null
SMILES: CCOCCn1c(nc2ccccc12)N1CCCNCC1
InChI Key: InChIKey=KCCFLPBATGOEJM-UHFFFAOYSA-N
Activity Spreadsheet -- Enzyme Inhibition Constant Data from BindingDB
Found 1 hit for monomerid = 50019639
Trg + Lig
Ki
nM
ΔG°
kcal/mole
IC50
nM
Kd
nM
EC50/IC50
nM
koff
s-1
kon
M-1s-1
pHTemp
°C
Histamine H1 receptor
(Cavia porcellus (domestic guinea pig))
BDBM50019639
(2-[1,4]Diazepan-1-yl-1-(2-ethoxy-ethyl)-1H-benzoim...)
Show SMILES CCOCCn1c(nc2ccccc12)N1CCCNCC1
Show InChI InChI=1S/C16H24N4O/c1-2-21-13-12-20-15-7-4-3-6-14(15)18-16(20)19-10-5-8-17-9-11-19/h3-4,6-7,17H,2,5,8-13H2,1H3
n/an/a 25n/an/an/an/an/an/a
TBA
Curated by ChEMBL
Assay Description
In vitro inhibition of histamine-induced contractions in guinea pig ileum
J Med Chem 29: 1178-83 (1987)
BindingDB Entry DOI: 10.7270/Q2QR4XPC