BDBM50019822 CHEMBL3286902
SMILES: O=C(OCC(C1CCNCC1)n1c(nc2ccccc12)-c1ccccc1)C1CCN(CC1)c1nc2ccccc2n1Cc1ccsc1
InChI Key: InChIKey=MIMZFWLVKRMQDU-UHFFFAOYSA-N
Data: 1 Kd
Activity Spreadsheet -- Enzyme Inhibition Constant Data from BindingDB
Found 1 hit for monomerid = 50019822
Trg + Lig
Ki
nM
ΔG°
kcal/mole
IC50
nM
Kd
nM
EC50/IC50
nM
koff
s-1
kon
M-1s-1
pHTemp
°C
Retinal rod rhodopsin-sensitive cGMP 3',5'-cyclic phosphodiesterase subunit delta
(Homo sapiens (Human))
BDBM50019822
(CHEMBL3286902)
Show SMILES O=C(OCC(C1CCNCC1)n1c(nc2ccccc12)-c1ccccc1)C1CCN(CC1)c1nc2ccccc2n1Cc1ccsc1
Show InChI InChI=1S/C38H40N6O2S/c45-37(30-16-21-42(22-17-30)38-41-31-10-4-6-12-33(31)43(38)24-27-18-23-47-26-27)46-25-35(28-14-19-39-20-15-28)44-34-13-7-5-11-32(34)40-36(44)29-8-2-1-3-9-29/h1-13,18,23,26,28,30,35,39H,14-17,19-22,24-25H2
n/an/an/a 9n/an/an/an/an/a
Max Planck Institute of Molecular Physiology
Curated by ChEMBL
Assay Description
Binding affinity to His6-tagged PDE-delta (unknown origin) measured every 3 mins by fluorescence polarization assay
J Med Chem 57: 5435-48 (2014)
Article DOI: 10.1021/jm500632s
BindingDB Entry DOI: 10.7270/Q24Q7WJP