BDBM50019862 CHEMBL3286926
SMILES: CC(C)c1c(cc(-c2ccccc2)n1CCCn1ccnc1C)-c1nc2ccccc2n1CC1CC1
InChI Key: InChIKey=PTGCBGFPNHVJIE-UHFFFAOYSA-N
Data: 1 Kd
Activity Spreadsheet -- Enzyme Inhibition Constant Data from BindingDB
Found 1 hit for monomerid = 50019862
Trg + Lig
Ki
nM
ΔG°
kcal/mole
IC50
nM
Kd
nM
EC50/IC50
nM
koff
s-1
kon
M-1s-1
pHTemp
°C
Retinal rod rhodopsin-sensitive cGMP 3',5'-cyclic phosphodiesterase subunit delta
(Homo sapiens (Human))
BDBM50019862
(CHEMBL3286926)
Show SMILES CC(C)c1c(cc(-c2ccccc2)n1CCCn1ccnc1C)-c1nc2ccccc2n1CC1CC1
Show InChI InChI=1S/C31H35N5/c1-22(2)30-26(31-33-27-12-7-8-13-28(27)36(31)21-24-14-15-24)20-29(25-10-5-4-6-11-25)35(30)18-9-17-34-19-16-32-23(34)3/h4-8,10-13,16,19-20,22,24H,9,14-15,17-18,21H2,1-3H3
n/an/an/a 251n/an/an/an/an/a
Max Planck Institute of Molecular Physiology
Curated by ChEMBL
Assay Description
Binding affinity to His6-tagged PDE-delta (unknown origin) measured every 3 mins by fluorescence polarization assay
J Med Chem 57: 5435-48 (2014)
Article DOI: 10.1021/jm500632s
BindingDB Entry DOI: 10.7270/Q24Q7WJP