BDBM50019901 CHEMBL3287206::US9533999, i-34
SMILES: CC(C)c1nc2N(Cc3ccc(F)c(OC(F)(F)F)c3)C(=O)CS(=O)(=O)c2s1
InChI Key: InChIKey=ZWDRWONPTSZBKW-UHFFFAOYSA-N
Data: 2 IC50
Activity Spreadsheet -- Enzyme Inhibition Constant Data from BindingDB
Found 2 hits for monomerid = 50019901
Trg + Lig
Ki
nM
ΔG°
kcal/mole
IC50
nM
Kd
nM
EC50/IC50
nM
koff
s-1
kon
M-1s-1
pHTemp
°C
Intermediate conductance calcium-activated potassium channel protein 4
(Homo sapiens (Human))
BDBM50019901
(CHEMBL3287206 | US9533999, i-34)
Show SMILES CC(C)c1nc2N(Cc3ccc(F)c(OC(F)(F)F)c3)C(=O)CS(=O)(=O)c2s1
Show InChI InChI=1S/C16H14F4N2O4S2/c1-8(2)14-21-13-15(27-14)28(24,25)7-12(23)22(13)6-9-3-4-10(17)11(5-9)26-16(18,19)20/h3-5,8H,6-7H2,1-2H3
Reactome pathway
US Patent
n/an/a 96n/an/an/an/an/an/a
Boehringer Ingelheim International GmbH
US Patent
Assay Description
HEK293 cells over-expressing human KCa3.1 are used to measure the effects of compounds in inhibiting the KCa3.1 channel function. The assay is based ...
US Patent US9533999 (2017)
BindingDB Entry DOI: 10.7270/Q21V5C4S
Intermediate conductance calcium-activated potassium channel protein 4
(Homo sapiens (Human))
BDBM50019901
(CHEMBL3287206 | US9533999, i-34)
Show SMILES CC(C)c1nc2N(Cc3ccc(F)c(OC(F)(F)F)c3)C(=O)CS(=O)(=O)c2s1
Show InChI InChI=1S/C16H14F4N2O4S2/c1-8(2)14-21-13-15(27-14)28(24,25)7-12(23)22(13)6-9-3-4-10(17)11(5-9)26-16(18,19)20/h3-5,8H,6-7H2,1-2H3
Reactome pathway
n/an/a 96n/an/an/an/an/an/a
Temple University School of Pharmacy
Curated by ChEMBL
Assay Description
Inhibition of human KCa3.1 overexpressed in HEK293 cells assessed as thallium influx preincubated for 15 mins followed by thallium/ionomycin addition...
ACS Med Chem Lett 5: 460-1 (2014)
Article DOI: 10.1021/ml500090s
BindingDB Entry DOI: 10.7270/Q2RJ4M2T