BDBM50019984 CHEMBL528724::GNF-Pf-1241
SMILES: Cc1cc2nc(NC(N)=N)nc(C)c2cc1C
InChI Key: InChIKey=JFQDHSRWWLJCBV-UHFFFAOYSA-N
Data: 2 IC50
Activity Spreadsheet -- Enzyme Inhibition Constant Data from BindingDB
Found 2 hits for monomerid = 50019984
Trg + Lig
Ki
nM
ΔG°
kcal/mole
IC50
nM
Kd
nM
EC50/IC50
nM
koff
s-1
kon
M-1s-1
pHTemp
°C
GPR103
(Homo sapiens (Human))
BDBM50019984
(CHEMBL528724 | GNF-Pf-1241)
Show SMILES Cc1cc2nc(NC(N)=N)nc(C)c2cc1C
Show InChI InChI=1S/C12H15N5/c1-6-4-9-8(3)15-12(17-11(13)14)16-10(9)5-7(6)2/h4-5H,1-3H3,(H4,13,14,15,16,17)
n/an/a 5.01E+3n/an/an/an/an/an/a
AstraZeneca
Curated by ChEMBL
Assay Description
Displacement of [125I]-QRFP43 from human GPR103 receptor overexpressed in HEK membranes after 90 mins by liquid scintillation counting
ACS Med Chem Lett 5: 527-32 (2014)
Article DOI: 10.1021/ml400519h
BindingDB Entry DOI: 10.7270/Q2V989NR
GPR103
(Homo sapiens (Human))
BDBM50019984
(CHEMBL528724 | GNF-Pf-1241)
Show SMILES Cc1cc2nc(NC(N)=N)nc(C)c2cc1C
Show InChI InChI=1S/C12H15N5/c1-6-4-9-8(3)15-12(17-11(13)14)16-10(9)5-7(6)2/h4-5H,1-3H3,(H4,13,14,15,16,17)
n/an/a 2.51E+3n/an/an/an/an/an/a
AstraZeneca
Curated by ChEMBL
Assay Description
Antagonist activity at human GPR103 receptor assessed as inhibition of inositol-1-phosphate production by cell-based assay
ACS Med Chem Lett 5: 527-32 (2014)
Article DOI: 10.1021/ml400519h
BindingDB Entry DOI: 10.7270/Q2V989NR