BDBM50020020 CHEMBL3287819
SMILES: COc1ccc(NC(=N)c2cccnc2)cc1CSC1CCCC1
InChI Key: InChIKey=YBUAAZCBBZGPCT-UHFFFAOYSA-N
Data: 2 IC50
Activity Spreadsheet -- Enzyme Inhibition Constant Data from BindingDB
Found 2 hits for monomerid = 50020020
Trg + Lig
Ki
nM
ΔG°
kcal/mole
IC50
nM
Kd
nM
EC50/IC50
nM
koff
s-1
kon
M-1s-1
pHTemp
°C
Pyroglutamylated RF-amide peptide receptor
(Homo sapiens (Human))
BDBM50020020
(CHEMBL3287819)
Show SMILES COc1ccc(NC(=N)c2cccnc2)cc1CSC1CCCC1
Show InChI InChI=1S/C19H23N3OS/c1-23-18-9-8-16(22-19(20)14-5-4-10-21-12-14)11-15(18)13-24-17-6-2-3-7-17/h4-5,8-12,17H,2-3,6-7,13H2,1H3,(H2,20,22)
n/an/a 501n/an/an/an/an/an/a
AstraZeneca
Curated by ChEMBL
Assay Description
Displacement of [125I]-QRFP43 from human GPR103 receptor overexpressed in HEK membranes after 90 mins by liquid scintillation counting
ACS Med Chem Lett 5: 527-32 (2014)
Article DOI: 10.1021/ml400519h
BindingDB Entry DOI: 10.7270/Q2V989NR
Pyroglutamylated RF-amide peptide receptor
(Homo sapiens (Human))
BDBM50020020
(CHEMBL3287819)
Show SMILES COc1ccc(NC(=N)c2cccnc2)cc1CSC1CCCC1
Show InChI InChI=1S/C19H23N3OS/c1-23-18-9-8-16(22-19(20)14-5-4-10-21-12-14)11-15(18)13-24-17-6-2-3-7-17/h4-5,8-12,17H,2-3,6-7,13H2,1H3,(H2,20,22)
n/an/a 251n/an/an/an/an/an/a
AstraZeneca
Curated by ChEMBL
Assay Description
Antagonist activity at human GPR103 receptor assessed as inhibition of inositol-1-phosphate production by cell-based assay
ACS Med Chem Lett 5: 527-32 (2014)
Article DOI: 10.1021/ml400519h
BindingDB Entry DOI: 10.7270/Q2V989NR