BDBM50020021 CHEMBL3287820
SMILES: COc1ccc(NC(=O)c2cccs2)cc1CSC1CCCC1
InChI Key: InChIKey=KIBYOEHXJOJYGK-UHFFFAOYSA-N
Data: 2 IC50
Activity Spreadsheet -- Enzyme Inhibition Constant Data from BindingDB
Found 2 hits for monomerid = 50020021
Trg + Lig
Ki
nM
ΔG°
kcal/mole
IC50
nM
Kd
nM
EC50/IC50
nM
koff
s-1
kon
M-1s-1
pHTemp
°C
GPR103
(Homo sapiens (Human))
BDBM50020021
(CHEMBL3287820)
Show SMILES COc1ccc(NC(=O)c2cccs2)cc1CSC1CCCC1
Show InChI InChI=1S/C18H21NO2S2/c1-21-16-9-8-14(19-18(20)17-7-4-10-22-17)11-13(16)12-23-15-5-2-3-6-15/h4,7-11,15H,2-3,5-6,12H2,1H3,(H,19,20)
n/an/a<3.16E+4n/an/an/an/an/an/a
AstraZeneca
Curated by ChEMBL
Assay Description
Displacement of [125I]-QRFP43 from human GPR103 receptor overexpressed in HEK membranes after 90 mins by liquid scintillation counting
ACS Med Chem Lett 5: 527-32 (2014)
Article DOI: 10.1021/ml400519h
BindingDB Entry DOI: 10.7270/Q2V989NR
GPR103
(Homo sapiens (Human))
BDBM50020021
(CHEMBL3287820)
Show SMILES COc1ccc(NC(=O)c2cccs2)cc1CSC1CCCC1
Show InChI InChI=1S/C18H21NO2S2/c1-21-16-9-8-14(19-18(20)17-7-4-10-22-17)11-13(16)12-23-15-5-2-3-6-15/h4,7-11,15H,2-3,5-6,12H2,1H3,(H,19,20)
n/an/a 7.94E+3n/an/an/an/an/an/a
AstraZeneca
Curated by ChEMBL
Assay Description
Antagonist activity at human GPR103 receptor assessed as inhibition of inositol-1-phosphate production by cell-based assay
ACS Med Chem Lett 5: 527-32 (2014)
Article DOI: 10.1021/ml400519h
BindingDB Entry DOI: 10.7270/Q2V989NR