BDBM50020042 CHEMBL3287856
SMILES: Fc1cccc(C[C@H]2C[C@H](CCN2)c2cc(=O)[nH]o2)c1
InChI Key: InChIKey=GQBSOTILFRHBGN-AAEUAGOBSA-N
Data: 1 IC50
Activity Spreadsheet -- Enzyme Inhibition Constant Data from BindingDB
Found 1 hit for monomerid = 50020042
Trg + Lig
Ki
nM
ΔG°
kcal/mole
IC50
nM
Kd
nM
EC50/IC50
nM
koff
s-1
kon
M-1s-1
pHTemp
°C
Plasminogen
(Homo sapiens (Human))
BDBM50020042
(CHEMBL3287856)
Show SMILES Fc1cccc(C[C@H]2C[C@H](CCN2)c2cc(=O)[nH]o2)c1 |r|
Show InChI InChI=1S/C15H17FN2O2/c16-12-3-1-2-10(6-12)7-13-8-11(4-5-17-13)14-9-15(19)18-20-14/h1-3,6,9,11,13,17H,4-5,7-8H2,(H,18,19)/t11-,13-/m0/s1
NCI pathway
Reactome pathway
n/an/a 360n/an/an/an/an/an/a
AstraZeneca
Curated by ChEMBL
Assay Description
Binding affinity to full length Glu-plasminogen in human plasma assessed as inhibition of interaction with fibrin in presence of tPA
ACS Med Chem Lett 5: 538-43 (2014)
Article DOI: 10.1021/ml400526d
BindingDB Entry DOI: 10.7270/Q2QJ7JV4