null
SMILES: CCC1CN(C(=O)Nc2ccccc2)c2ccc(cc2O1)-c1ccc(OC[C@H]2C[C@@H]2C(O)=O)nc1
InChI Key: InChIKey=DSCRPKKTYZZEQD-QOMKKIOMSA-N
Activity Spreadsheet -- Enzyme Inhibition Constant Data from BindingDB
Found 2 hits for monomerid = 50020061
Trg + Lig
Ki
nM
ΔG°
kcal/mole
IC50
nM
Kd
nM
EC50/IC50
nM
koff
s-1
kon
M-1s-1
pHTemp
°C
Diacylglycerol O-acyltransferase 1
(Homo sapiens (Human))
BDBM50020061
(CHEMBL3287891)
Show SMILES CCC1CN(C(=O)Nc2ccccc2)c2ccc(cc2O1)-c1ccc(OC[C@H]2C[C@@H]2C(O)=O)nc1 |r|
Show InChI InChI=1S/C27H27N3O5/c1-2-21-15-30(27(33)29-20-6-4-3-5-7-20)23-10-8-17(13-24(23)35-21)18-9-11-25(28-14-18)34-16-19-12-22(19)26(31)32/h3-11,13-14,19,21-22H,2,12,15-16H2,1H3,(H,29,33)(H,31,32)/t19-,21?,22+/m1/s1
n/an/a 860n/an/an/an/an/an/a
Merck Research Laboratories
Curated by ChEMBL
Assay Description
Inhibition of human DGAT1 expressed in Sf9 insect cells using 1,2-dioleoyl-sn-glycerol and [14C]-palmitoyl-CoA substrate by scintillation counting an...
ACS Med Chem Lett 5: 544-9 (2014)
Article DOI: 10.1021/ml400527n
BindingDB Entry DOI: 10.7270/Q2KS6T3C
Diacylglycerol O-acyltransferase 1
(Mus musculus (mouse))
BDBM50020061
(CHEMBL3287891)
Show SMILES CCC1CN(C(=O)Nc2ccccc2)c2ccc(cc2O1)-c1ccc(OC[C@H]2C[C@@H]2C(O)=O)nc1 |r|
Show InChI InChI=1S/C27H27N3O5/c1-2-21-15-30(27(33)29-20-6-4-3-5-7-20)23-10-8-17(13-24(23)35-21)18-9-11-25(28-14-18)34-16-19-12-22(19)26(31)32/h3-11,13-14,19,21-22H,2,12,15-16H2,1H3,(H,29,33)(H,31,32)/t19-,21?,22+/m1/s1
Reactome pathway
n/an/a 210n/an/an/an/an/an/a
Merck Research Laboratories
Curated by ChEMBL
Assay Description
Inhibition of mouse DGAT1 expressed in Sf9 insect cells using 1,2-dioleoyl-sn-glycerol and [14C]-palmitoyl-CoA substrate by scintillation counting an...
ACS Med Chem Lett 5: 544-9 (2014)
Article DOI: 10.1021/ml400527n
BindingDB Entry DOI: 10.7270/Q2KS6T3C