null
SMILES: OC(=O)[C@@H]1CCC[C@H]1C(=O)c1ccc(cc1)-c1ccc2N(CCOc2c1)C(=O)Nc1ccccc1
InChI Key: InChIKey=SADJVSZBLBNJOK-DHIUTWEWSA-N
Activity Spreadsheet -- Enzyme Inhibition Constant Data from BindingDB
Found 2 hits for monomerid = 50020071
Trg + Lig
Ki
nM
ΔG°
kcal/mole
IC50
nM
Kd
nM
EC50/IC50
nM
koff
s-1
kon
M-1s-1
pHTemp
°C
Diacylglycerol O-acyltransferase 1
(Mus musculus (mouse))
BDBM50020071
(CHEMBL3287889)
Show SMILES OC(=O)[C@@H]1CCC[C@H]1C(=O)c1ccc(cc1)-c1ccc2N(CCOc2c1)C(=O)Nc1ccccc1 |r|
Show InChI InChI=1S/C28H26N2O5/c31-26(22-7-4-8-23(22)27(32)33)19-11-9-18(10-12-19)20-13-14-24-25(17-20)35-16-15-30(24)28(34)29-21-5-2-1-3-6-21/h1-3,5-6,9-14,17,22-23H,4,7-8,15-16H2,(H,29,34)(H,32,33)/t22-,23-/m1/s1
Reactome pathway
n/an/a 830n/an/an/an/an/an/a
Merck Research Laboratories
Curated by ChEMBL
Assay Description
Inhibition of mouse DGAT1 expressed in Sf9 insect cells using 1,2-dioleoyl-sn-glycerol and [14C]-palmitoyl-CoA substrate by scintillation counting an...
ACS Med Chem Lett 5: 544-9 (2014)
Article DOI: 10.1021/ml400527n
BindingDB Entry DOI: 10.7270/Q2KS6T3C
Diacylglycerol O-acyltransferase 1
(Homo sapiens (Human))
BDBM50020071
(CHEMBL3287889)
Show SMILES OC(=O)[C@@H]1CCC[C@H]1C(=O)c1ccc(cc1)-c1ccc2N(CCOc2c1)C(=O)Nc1ccccc1 |r|
Show InChI InChI=1S/C28H26N2O5/c31-26(22-7-4-8-23(22)27(32)33)19-11-9-18(10-12-19)20-13-14-24-25(17-20)35-16-15-30(24)28(34)29-21-5-2-1-3-6-21/h1-3,5-6,9-14,17,22-23H,4,7-8,15-16H2,(H,29,34)(H,32,33)/t22-,23-/m1/s1
n/an/a 630n/an/an/an/an/an/a
Merck Research Laboratories
Curated by ChEMBL
Assay Description
Inhibition of human DGAT1 expressed in Sf9 insect cells using 1,2-dioleoyl-sn-glycerol and [14C]-palmitoyl-CoA substrate by scintillation counting an...
ACS Med Chem Lett 5: 544-9 (2014)
Article DOI: 10.1021/ml400527n
BindingDB Entry DOI: 10.7270/Q2KS6T3C