BDBM50020164 CHEMBL3288475
SMILES: Cc1ccc(cc1)-c1csc(NC(=O)CCCCCCS)n1
InChI Key: InChIKey=CYQGDLYBYHOZHO-UHFFFAOYSA-N
Data: 2 IC50
Activity Spreadsheet -- Enzyme Inhibition Constant Data from BindingDB
Found 2 hits for monomerid = 50020164
Trg + Lig
Ki
nM
ΔG°
kcal/mole
IC50
nM
Kd
nM
EC50/IC50
nM
koff
s-1
kon
M-1s-1
pHTemp
°C
Histone deacetylase 9
(Homo sapiens (Human))
BDBM50020164
(CHEMBL3288475)
Show SMILES Cc1ccc(cc1)-c1csc(NC(=O)CCCCCCS)n1
Show InChI InChI=1S/C17H22N2OS2/c1-13-7-9-14(10-8-13)15-12-22-17(18-15)19-16(20)6-4-2-3-5-11-21/h7-10,12,21H,2-6,11H2,1H3,(H,18,19,20)
Reactome pathway
n/an/a 42n/an/an/an/an/an/a
Nagoya University
Curated by ChEMBL
Assay Description
Inhibition of human HDAC9 by HDAC-Glo assay
ACS Med Chem Lett 5: 582-6 (2014)
Article DOI: 10.1021/ml500024s
BindingDB Entry DOI: 10.7270/Q2Z3217N
Histone deacetylase 1
(Homo sapiens (Human))
BDBM50020164
(CHEMBL3288475)
Show SMILES Cc1ccc(cc1)-c1csc(NC(=O)CCCCCCS)n1
Show InChI InChI=1S/C17H22N2OS2/c1-13-7-9-14(10-8-13)15-12-22-17(18-15)19-16(20)6-4-2-3-5-11-21/h7-10,12,21H,2-6,11H2,1H3,(H,18,19,20)
NCI pathway
Reactome pathway
n/an/a 57n/an/an/an/an/an/a
Nagoya University
Curated by ChEMBL
Assay Description
Inhibition of human HDAC1 by HDAC-Glo assay
ACS Med Chem Lett 5: 582-6 (2014)
Article DOI: 10.1021/ml500024s
BindingDB Entry DOI: 10.7270/Q2Z3217N