BDBM50020287 7-[2,6-Dimethyl-8-(2-methyl-butyryloxy)-1,2,4a,5,6,7,8,8a-octahydro-naphthalen-1-yl]-3-hydroxy-5-oxo-heptanoic acid::7-[2,6-Dimethyl-8-(2-methyl-butyryloxy)-1,2,4a,5,6,7,8,8a-octahydro-naphthalen-1-yl]-3-hydroxy-5-oxo-heptanoic acid(5-ketodihydromevinolin)::CHEMBL293944
SMILES: CC[C@H](C)C(=O)O[C@H]1C[C@@H](C)C[C@@H]2C=C[C@H](C)[C@H](CCC(=O)C[C@@H](O)CC(O)=O)C12
InChI Key: InChIKey=OOKAZRDERJMRCJ-KOUAFAAESA-N
Data: 1 IC50
Activity Spreadsheet -- Enzyme Inhibition Constant Data from BindingDB
Found 1 hit for monomerid = 50020287
Trg + Lig
Ki
nM
ΔG°
kcal/mole
IC50
nM
Kd
nM
EC50/IC50
nM
koff
s-1
kon
M-1s-1
pHTemp
°C
HMG-CoA reductase
(Rattus norvegicus (rat))
BDBM50020287
(7-[2,6-Dimethyl-8-(2-methyl-butyryloxy)-1,2,4a,5,6...)
Show SMILES CC[C@H](C)C(=O)O[C@H]1C[C@@H](C)C[C@@H]2C=C[C@H](C)[C@H](CCC(=O)C[C@@H](O)CC(O)=O)C12 |c:13|
Show InChI InChI=1S/C24H38O6/c1-5-15(3)24(29)30-21-11-14(2)10-17-7-6-16(4)20(23(17)21)9-8-18(25)12-19(26)13-22(27)28/h6-7,14-17,19-21,23,26H,5,8-13H2,1-4H3,(H,27,28)/t14-,15-,16-,17-,19+,20-,21-,23?/m0/s1
Reactome pathway
n/an/a 1n/an/an/an/an/an/a
University of California
Curated by ChEMBL
Assay Description
Ability of compound to inhibit the activity of 3-hydroxy-3-methylglutarylcoenzyme A(HMGR) reductase in rat liver microsomes
J Med Chem 32: 197-202 (1989)
BindingDB Entry DOI: 10.7270/Q24T6HB3