BDBM50020378 CHEMBL3289787
SMILES: CC(=O)Cc1cc(O)c2C(=O)c3c(O)cc(O)cc3C(=O)c2c1
InChI Key: InChIKey=RWRSHBQDDHCLAY-UHFFFAOYSA-N
Data: 1 IC50
Activity Spreadsheet -- Enzyme Inhibition Constant Data from BindingDB
Found 1 hit for monomerid = 50020378
Trg + Lig
Ki
nM
ΔG°
kcal/mole
IC50
nM
Kd
nM
EC50/IC50
nM
koff
s-1
kon
M-1s-1
pHTemp
°C
Accessory gene regulator protein A
(Staphylococcus aureus)
BDBM50020378
(CHEMBL3289787)
Show SMILES CC(=O)Cc1cc(O)c2C(=O)c3c(O)cc(O)cc3C(=O)c2c1
Show InChI InChI=1S/C17H12O6/c1-7(18)2-8-3-10-14(12(20)4-8)17(23)15-11(16(10)22)5-9(19)6-13(15)21/h3-6,19-21H,2H2,1H3
n/an/a 1.98E+4n/an/an/an/an/an/a
University of North Carolina at Greensboro
Curated by ChEMBL
Assay Description
Inhibition of AGR quorum sensing system in methicillin-resistant Staphylococcus aureus AH2759 incubated for 15 hrs by P3-LUX reporter gene assay
J Nat Prod 77: 1351-8 (2014)
Article DOI: 10.1021/np5000704
BindingDB Entry DOI: 10.7270/Q21V5GJD