BDBM50020526 CHEMBL2392186
SMILES: COc1cc(CCC(=O)CC(=O)CCc2cc(CCC(C)C)c(O)c(OC)c2)cc(CCC(C)C)c1O
InChI Key: InChIKey=RGQRMXOWQQAADE-UHFFFAOYSA-N
Data: 3 IC50
Activity Spreadsheet -- Enzyme Inhibition Constant Data from BindingDB
Found 3 hits for monomerid = 50020526
Trg + Lig
Ki
nM
ΔG°
kcal/mole
IC50
nM
Kd
nM
EC50/IC50
nM
koff
s-1
kon
M-1s-1
pHTemp
°C
Polyunsaturated fatty acid 5-lipoxygenase
(Homo sapiens (Human))
BDBM50020526
(CHEMBL2392186)
Show SMILES COc1cc(CCC(=O)CC(=O)CCc2cc(CCC(C)C)c(O)c(OC)c2)cc(CCC(C)C)c1O
Show InChI InChI=1S/C31H44O6/c1-20(2)7-11-24-15-22(17-28(36-5)30(24)34)9-13-26(32)19-27(33)14-10-23-16-25(12-8-21(3)4)31(35)29(18-23)37-6/h15-18,20-21,34-35H,7-14,19H2,1-6H3
Reactome pathway
n/an/a 400n/an/an/an/an/an/a
University Jena
Curated by ChEMBL
Assay Description
Inhibition of human recombinant 5-LO expressed in Escherichia coli Bl21 (DE3) using arachidonic acid as substrate preincubated for 10 mins measured a...
J Med Chem 57: 5638-48 (2014)
Article DOI: 10.1021/jm500308c
BindingDB Entry DOI: 10.7270/Q2HT2QWN
Signal transducer and activator of transcription 3
(Homo sapiens (Human))
BDBM50020526
(CHEMBL2392186)
Show SMILES COc1cc(CCC(=O)CC(=O)CCc2cc(CCC(C)C)c(O)c(OC)c2)cc(CCC(C)C)c1O
Show InChI InChI=1S/C31H44O6/c1-20(2)7-11-24-15-22(17-28(36-5)30(24)34)9-13-26(32)19-27(33)14-10-23-16-25(12-8-21(3)4)31(35)29(18-23)37-6/h15-18,20-21,34-35H,7-14,19H2,1-6H3
n/an/a>5.00E+4n/an/an/an/an/an/a
University Jena
Curated by ChEMBL
Assay Description
Inhibition of STAT3 transcriptional activity in human HaCaT cells after 6 hrs by luciferase reporter gene assay
J Med Chem 57: 5638-48 (2014)
Article DOI: 10.1021/jm500308c
BindingDB Entry DOI: 10.7270/Q2HT2QWN
Polyunsaturated fatty acid 5-lipoxygenase
(Homo sapiens (Human))
BDBM50020526
(CHEMBL2392186)
Show SMILES COc1cc(CCC(=O)CC(=O)CCc2cc(CCC(C)C)c(O)c(OC)c2)cc(CCC(C)C)c1O
Show InChI InChI=1S/C31H44O6/c1-20(2)7-11-24-15-22(17-28(36-5)30(24)34)9-13-26(32)19-27(33)14-10-23-16-25(12-8-21(3)4)31(35)29(18-23)37-6/h15-18,20-21,34-35H,7-14,19H2,1-6H3
Reactome pathway
n/an/a 2.90E+3n/an/an/an/an/an/a
University Jena
Curated by ChEMBL
Assay Description
Inhibition of 5-LO in human neutrophils using arachidonic acid as substrate preincubated for 15 mins measured after 10 mins by HPLC analysis
J Med Chem 57: 5638-48 (2014)
Article DOI: 10.1021/jm500308c
BindingDB Entry DOI: 10.7270/Q2HT2QWN