BDBM50020602 CHEMBL3290457
SMILES: C[C@H]1Cc2cccc(C(N)=O)c2O1
InChI Key: InChIKey=JKXUEKXDADMQFP-LURJTMIESA-N
Data: 1 IC50
Activity Spreadsheet -- Enzyme Inhibition Constant Data from BindingDB
Found 1 hit for monomerid = 50020602
Trg + Lig
Ki
nM
ΔG°
kcal/mole
IC50
nM
Kd
nM
EC50/IC50
nM
koff
s-1
kon
M-1s-1
pHTemp
°C
Poly [ADP-ribose] polymerase 1
(Homo sapiens (Human))
BDBM50020602
(CHEMBL3290457)
Show SMILES C[C@H]1Cc2cccc(C(N)=O)c2O1 |r|
Show InChI InChI=1S/C10H11NO2/c1-6-5-7-3-2-4-8(10(11)12)9(7)13-6/h2-4,6H,5H2,1H3,(H2,11,12)/t6-/m0/s1
n/an/a 8.44E+3n/an/an/an/an/an/a
St. John's University
Curated by ChEMBL
Assay Description
Inhibition of PARP-1 (unknown origin) using biotinylated NAD+ as substrate after 60 mins by spectrophotometry
J Med Chem 57: 5579-601 (2014)
Article DOI: 10.1021/jm5002502
BindingDB Entry DOI: 10.7270/Q28C9XSS