BDBM50020623 CHEMBL3290473
SMILES: NC(=O)c1cccc2C(=O)\C(Oc12)=C\c1ccccc1O
InChI Key: InChIKey=CWMOTFOFKSSLOC-JYRVWZFOSA-N
Data: 1 IC50
Activity Spreadsheet -- Enzyme Inhibition Constant Data from BindingDB
Found 1 hit for monomerid = 50020623
Trg + Lig
Ki
nM
ΔG°
kcal/mole
IC50
nM
Kd
nM
EC50/IC50
nM
koff
s-1
kon
M-1s-1
pHTemp
°C
Poly [ADP-ribose] polymerase 1
(Homo sapiens (Human))
BDBM50020623
(CHEMBL3290473)
Show SMILES NC(=O)c1cccc2C(=O)\C(Oc12)=C\c1ccccc1O
Show InChI InChI=1S/C16H11NO4/c17-16(20)11-6-3-5-10-14(19)13(21-15(10)11)8-9-4-1-2-7-12(9)18/h1-8,18H,(H2,17,20)/b13-8-
n/an/a>1.00E+4n/an/an/an/an/an/a
St. John's University
Curated by ChEMBL
Assay Description
Inhibition of PARP-1 (unknown origin) using biotinylated NAD+ as substrate after 60 mins by spectrophotometry
J Med Chem 57: 5579-601 (2014)
Article DOI: 10.1021/jm5002502
BindingDB Entry DOI: 10.7270/Q28C9XSS