BDBM50020625 CHEMBL3290475
SMILES: NC(=O)c1cccc2C(=O)\C(Oc12)=C\c1ccc(O)cc1
InChI Key: InChIKey=GDNQOWJOOJVFTM-JYRVWZFOSA-N
Data: 1 IC50
Activity Spreadsheet -- Enzyme Inhibition Constant Data from BindingDB
Found 1 hit for monomerid = 50020625
Trg + Lig
Ki
nM
ΔG°
kcal/mole
IC50
nM
Kd
nM
EC50/IC50
nM
koff
s-1
kon
M-1s-1
pHTemp
°C
Poly [ADP-ribose] polymerase 1
(Homo sapiens (Human))
BDBM50020625
(CHEMBL3290475)
Show SMILES NC(=O)c1cccc2C(=O)\C(Oc12)=C\c1ccc(O)cc1
Show InChI InChI=1S/C16H11NO4/c17-16(20)12-3-1-2-11-14(19)13(21-15(11)12)8-9-4-6-10(18)7-5-9/h1-8,18H,(H2,17,20)/b13-8-
n/an/a 813n/an/an/an/an/an/a
St. John's University
Curated by ChEMBL
Assay Description
Inhibition of PARP-1 (unknown origin) using biotinylated NAD+ as substrate after 60 mins by spectrophotometry
J Med Chem 57: 5579-601 (2014)
Article DOI: 10.1021/jm5002502
BindingDB Entry DOI: 10.7270/Q28C9XSS