BDBM50020626 CHEMBL3290476
SMILES: NC(=O)c1cccc2C(=O)\C(Oc12)=C\c1ccc(O)c(O)c1
InChI Key: InChIKey=HBOFUXHOPLHDJN-QPEQYQDCSA-N
Data: 1 IC50
Activity Spreadsheet -- Enzyme Inhibition Constant Data from BindingDB
Found 1 hit for monomerid = 50020626
Trg + Lig
Ki
nM
ΔG°
kcal/mole
IC50
nM
Kd
nM
EC50/IC50
nM
koff
s-1
kon
M-1s-1
pHTemp
°C
Poly [ADP-ribose] polymerase 1
(Homo sapiens (Human))
BDBM50020626
(CHEMBL3290476)
Show SMILES NC(=O)c1cccc2C(=O)\C(Oc12)=C\c1ccc(O)c(O)c1
Show InChI InChI=1S/C16H11NO5/c17-16(21)10-3-1-2-9-14(20)13(22-15(9)10)7-8-4-5-11(18)12(19)6-8/h1-7,18-19H,(H2,17,21)/b13-7-
n/an/a 531n/an/an/an/an/an/a
St. John's University
Curated by ChEMBL
Assay Description
Inhibition of PARP-1 (unknown origin) using biotinylated NAD+ as substrate after 60 mins by spectrophotometry
J Med Chem 57: 5579-601 (2014)
Article DOI: 10.1021/jm5002502
BindingDB Entry DOI: 10.7270/Q28C9XSS