BDBM50020627 CHEMBL3290477
SMILES: NC(=O)c1cccc2C(=O)\C(Oc12)=C\c1ccc(O)cc1O
InChI Key: InChIKey=IANCBPDHSPOPRZ-MLPAPPSSSA-N
Data: 1 IC50
PDB links: 1 PDB ID matches this monomer.
Activity Spreadsheet -- Enzyme Inhibition Constant Data from BindingDB
Found 1 hit for monomerid = 50020627
Trg + Lig
Ki
nM
ΔG°
kcal/mole
IC50
nM
Kd
nM
EC50/IC50
nM
koff
s-1
kon
M-1s-1
pHTemp
°C
Poly [ADP-ribose] polymerase 1
(Homo sapiens (Human))
BDBM50020627
(CHEMBL3290477)
Show SMILES NC(=O)c1cccc2C(=O)\C(Oc12)=C\c1ccc(O)cc1O
Show InChI InChI=1S/C16H11NO5/c17-16(21)11-3-1-2-10-14(20)13(22-15(10)11)6-8-4-5-9(18)7-12(8)19/h1-7,18-19H,(H2,17,21)/b13-6-
n/an/a 753n/an/an/an/an/an/a
St. John's University
Curated by ChEMBL
Assay Description
Inhibition of PARP-1 (unknown origin) using biotinylated NAD+ as substrate after 60 mins by spectrophotometry
J Med Chem 57: 5579-601 (2014)
Article DOI: 10.1021/jm5002502
BindingDB Entry DOI: 10.7270/Q28C9XSS
3D
3D Structure (crystal)