null
SMILES: Cl.C1C2C1C1C=CC2C2CNCC12
InChI Key: InChIKey=BELHISANSQBLPB-UHFFFAOYSA-N
Activity Spreadsheet -- Enzyme Inhibition Constant Data from BindingDB
Found 1 hit for monomerid = 50020750
Trg + Lig
Ki
nM
ΔG°
kcal/mole
IC50
nM
Kd
nM
EC50/IC50
nM
koff
s-1
kon
M-1s-1
pHTemp
°C
Matrix protein 2
(Influenza A virus (A/Udorn/307/1972(H3N2)))
BDBM50020750
(CHEMBL3286970)
Show SMILES Cl.C1C2C1C1C=CC2C2CNCC12 |c:5,TLB:11:12:5.6:2.3,1:3:5.6:12.8,THB:9:8:5.6:2.3|
Show InChI InChI=1S/C11H15N.ClH/c1-2-7-9-3-8(9)6(1)10-4-12-5-11(7)10;/h1-2,6-12H,3-5H2;1H
n/an/a 2.92E+3n/an/an/an/an/an/a
Universitat de Barcelona
Curated by ChEMBL
Assay Description
Inhibition of wild type Influenza A virus (A/udorn/72(H3N2)) M2 channel expressed in Xenopus oocyte plasma membrane incubated for 2 mins measured ove...
J Med Chem 57: 5738-47 (2014)
Article DOI: 10.1021/jm5005804
BindingDB Entry DOI: 10.7270/Q23N24Z2