null
SMILES: Cc1nc(cs1)-c1nc(cs1)C(=O)NCCCCC(=O)NO
InChI Key: InChIKey=YHULCWIEZUPPSB-UHFFFAOYSA-N
Activity Spreadsheet -- Enzyme Inhibition Constant Data from BindingDB
Found 6 hits for monomerid = 50020885
Trg + Lig
Ki
nM
ΔG°
kcal/mole
IC50
nM
Kd
nM
EC50/IC50
nM
koff
s-1
kon
M-1s-1
pHTemp
°C
Histone deacetylase 1
(Homo sapiens (Human))
BDBM50020885
(CHEMBL3287022 | US9216962, CFH340-4)
Show SMILES Cc1nc(cs1)-c1nc(cs1)C(=O)NCCCCC(=O)NO
Show InChI InChI=1S/C13H16N4O3S2/c1-8-15-10(7-21-8)13-16-9(6-22-13)12(19)14-5-3-2-4-11(18)17-20/h6-7,20H,2-5H2,1H3,(H,14,19)(H,17,18)
NCI pathway
Reactome pathway
US Patent
n/an/a 535n/an/an/an/an/an/a
Shanghai Puyi Chemical Co., Ltd.
US Patent
Assay Description
Enzyme activity of HDAC1,3 is determined using the substrate Ac-Lys-Tyr-Lys(Ac)-AMC while the enzyme activity of HDAC6 is assayed using the substrate...
US Patent US9216962 (2015)
BindingDB Entry DOI: 10.7270/Q2QJ7G3F
Histone deacetylase 3
(Homo sapiens (Human))
BDBM50020885
(CHEMBL3287022 | US9216962, CFH340-4)
Show SMILES Cc1nc(cs1)-c1nc(cs1)C(=O)NCCCCC(=O)NO
Show InChI InChI=1S/C13H16N4O3S2/c1-8-15-10(7-21-8)13-16-9(6-22-13)12(19)14-5-3-2-4-11(18)17-20/h6-7,20H,2-5H2,1H3,(H,14,19)(H,17,18)
NCI pathway
Reactome pathway
US Patent
n/an/a 615n/an/an/an/an/an/a
Shanghai Puyi Chemical Co., Ltd.
US Patent
Assay Description
Enzyme activity of HDAC1,3 is determined using the substrate Ac-Lys-Tyr-Lys(Ac)-AMC while the enzyme activity of HDAC6 is assayed using the substrate...
US Patent US9216962 (2015)
BindingDB Entry DOI: 10.7270/Q2QJ7G3F
Histone deacetylase 6
(Homo sapiens (Human))
BDBM50020885
(CHEMBL3287022 | US9216962, CFH340-4)
Show SMILES Cc1nc(cs1)-c1nc(cs1)C(=O)NCCCCC(=O)NO
Show InChI InChI=1S/C13H16N4O3S2/c1-8-15-10(7-21-8)13-16-9(6-22-13)12(19)14-5-3-2-4-11(18)17-20/h6-7,20H,2-5H2,1H3,(H,14,19)(H,17,18)
NCI pathway
Reactome pathway
n/an/a 1.19E+3n/an/an/an/an/an/a
Chinese National Center for Drug Screening
Curated by ChEMBL
Assay Description
Inhibition of recombinant human HDAC6 using Boc-Lys(epsilon-acetyl)-AMC as substrate after 3 hrs by fluorescence assay
ACS Med Chem Lett 5: 628-33 (2014)
Article DOI: 10.1021/ml400470s
BindingDB Entry DOI: 10.7270/Q2V40WRC
Histone deacetylase 1
(Homo sapiens (Human))
BDBM50020885
(CHEMBL3287022 | US9216962, CFH340-4)
Show SMILES Cc1nc(cs1)-c1nc(cs1)C(=O)NCCCCC(=O)NO
Show InChI InChI=1S/C13H16N4O3S2/c1-8-15-10(7-21-8)13-16-9(6-22-13)12(19)14-5-3-2-4-11(18)17-20/h6-7,20H,2-5H2,1H3,(H,14,19)(H,17,18)
NCI pathway
Reactome pathway
n/an/a 240n/an/an/an/an/an/a
Chinese National Center for Drug Screening
Curated by ChEMBL
Assay Description
Inhibition of recombinant human HDAC1 using Ac-Lys-Tyr-Lys(epsilon-acetyl)-AMC as substrate after 24 hrs by fluorescence assay
ACS Med Chem Lett 5: 628-33 (2014)
Article DOI: 10.1021/ml400470s
BindingDB Entry DOI: 10.7270/Q2V40WRC
Histone deacetylase 3
(Homo sapiens (Human))
BDBM50020885
(CHEMBL3287022 | US9216962, CFH340-4)
Show SMILES Cc1nc(cs1)-c1nc(cs1)C(=O)NCCCCC(=O)NO
Show InChI InChI=1S/C13H16N4O3S2/c1-8-15-10(7-21-8)13-16-9(6-22-13)12(19)14-5-3-2-4-11(18)17-20/h6-7,20H,2-5H2,1H3,(H,14,19)(H,17,18)
NCI pathway
Reactome pathway
n/an/a 150n/an/an/an/an/an/a
Chinese National Center for Drug Screening
Curated by ChEMBL
Assay Description
Inhibition of recombinant human HDAC3 using Ac-Lys-Tyr-Lys(epsilon-acetyl)-AMC as substrate after 24 hrs by fluorescence assay
ACS Med Chem Lett 5: 628-33 (2014)
Article DOI: 10.1021/ml400470s
BindingDB Entry DOI: 10.7270/Q2V40WRC
Histone deacetylase 6
(Homo sapiens (Human))
BDBM50020885
(CHEMBL3287022 | US9216962, CFH340-4)
Show SMILES Cc1nc(cs1)-c1nc(cs1)C(=O)NCCCCC(=O)NO
Show InChI InChI=1S/C13H16N4O3S2/c1-8-15-10(7-21-8)13-16-9(6-22-13)12(19)14-5-3-2-4-11(18)17-20/h6-7,20H,2-5H2,1H3,(H,14,19)(H,17,18)
NCI pathway
Reactome pathway
US Patent
n/an/a 1.19E+3n/an/an/an/an/an/a
Shanghai Puyi Chemical Co., Ltd.
US Patent
Assay Description
Enzyme activity of HDAC1,3 is determined using the substrate Ac-Lys-Tyr-Lys(Ac)-AMC while the enzyme activity of HDAC6 is assayed using the substrate...
US Patent US9216962 (2015)
BindingDB Entry DOI: 10.7270/Q2QJ7G3F