BDBM50020889 CHEMBL3287023::US9216962, CFH326
SMILES: ONC(=O)CCCCNC(=O)c1csc(n1)-c1nccs1
InChI Key: InChIKey=ZFGHUXHZSKBOPL-UHFFFAOYSA-N
Data: 6 IC50
Activity Spreadsheet -- Enzyme Inhibition Constant Data from BindingDB
Found 6 hits for monomerid = 50020889
Trg + Lig
Ki
nM
ΔG°
kcal/mole
IC50
nM
Kd
nM
EC50/IC50
nM
koff
s-1
kon
M-1s-1
pHTemp
°C
Histone deacetylase 1
(Homo sapiens (Human))
BDBM50020889
(CHEMBL3287023 | US9216962, CFH326)
Show SMILES ONC(=O)CCCCNC(=O)c1csc(n1)-c1nccs1
Show InChI InChI=1S/C12H14N4O3S2/c17-9(16-19)3-1-2-4-13-10(18)8-7-21-12(15-8)11-14-5-6-20-11/h5-7,19H,1-4H2,(H,13,18)(H,16,17)
NCI pathway
Reactome pathway
US Patent
n/an/a 212n/an/an/an/an/an/a
Shanghai Puyi Chemical Co., Ltd.
US Patent
Assay Description
Enzyme activity of HDAC1,3 is determined using the substrate Ac-Lys-Tyr-Lys(Ac)-AMC while the enzyme activity of HDAC6 is assayed using the substrate...
US Patent US9216962 (2015)
BindingDB Entry DOI: 10.7270/Q2QJ7G3F
Histone deacetylase 3
(Homo sapiens (Human))
BDBM50020889
(CHEMBL3287023 | US9216962, CFH326)
Show SMILES ONC(=O)CCCCNC(=O)c1csc(n1)-c1nccs1
Show InChI InChI=1S/C12H14N4O3S2/c17-9(16-19)3-1-2-4-13-10(18)8-7-21-12(15-8)11-14-5-6-20-11/h5-7,19H,1-4H2,(H,13,18)(H,16,17)
NCI pathway
Reactome pathway
US Patent
n/an/a 107n/an/an/an/an/an/a
Shanghai Puyi Chemical Co., Ltd.
US Patent
Assay Description
Enzyme activity of HDAC1,3 is determined using the substrate Ac-Lys-Tyr-Lys(Ac)-AMC while the enzyme activity of HDAC6 is assayed using the substrate...
US Patent US9216962 (2015)
BindingDB Entry DOI: 10.7270/Q2QJ7G3F
Cereblon/Histone deacetylase 6
(Homo sapiens (Human))
BDBM50020889
(CHEMBL3287023 | US9216962, CFH326)
Show SMILES ONC(=O)CCCCNC(=O)c1csc(n1)-c1nccs1
Show InChI InChI=1S/C12H14N4O3S2/c17-9(16-19)3-1-2-4-13-10(18)8-7-21-12(15-8)11-14-5-6-20-11/h5-7,19H,1-4H2,(H,13,18)(H,16,17)
NCI pathway
Reactome pathway
n/an/a 1.10E+3n/an/an/an/an/an/a
Chinese National Center for Drug Screening
Curated by ChEMBL
Assay Description
Inhibition of recombinant human HDAC6 using Boc-Lys(epsilon-acetyl)-AMC as substrate after 3 hrs by fluorescence assay
ACS Med Chem Lett 5: 628-33 (2014)
Article DOI: 10.1021/ml400470s
BindingDB Entry DOI: 10.7270/Q2V40WRC
Histone deacetylase 1
(Homo sapiens (Human))
BDBM50020889
(CHEMBL3287023 | US9216962, CFH326)
Show SMILES ONC(=O)CCCCNC(=O)c1csc(n1)-c1nccs1
Show InChI InChI=1S/C12H14N4O3S2/c17-9(16-19)3-1-2-4-13-10(18)8-7-21-12(15-8)11-14-5-6-20-11/h5-7,19H,1-4H2,(H,13,18)(H,16,17)
NCI pathway
Reactome pathway
n/an/a 210n/an/an/an/an/an/a
Chinese National Center for Drug Screening
Curated by ChEMBL
Assay Description
Inhibition of recombinant human HDAC1 using Ac-Lys-Tyr-Lys(epsilon-acetyl)-AMC as substrate after 24 hrs by fluorescence assay
ACS Med Chem Lett 5: 628-33 (2014)
Article DOI: 10.1021/ml400470s
BindingDB Entry DOI: 10.7270/Q2V40WRC
Histone deacetylase 3
(Homo sapiens (Human))
BDBM50020889
(CHEMBL3287023 | US9216962, CFH326)
Show SMILES ONC(=O)CCCCNC(=O)c1csc(n1)-c1nccs1
Show InChI InChI=1S/C12H14N4O3S2/c17-9(16-19)3-1-2-4-13-10(18)8-7-21-12(15-8)11-14-5-6-20-11/h5-7,19H,1-4H2,(H,13,18)(H,16,17)
NCI pathway
Reactome pathway
n/an/a 110n/an/an/an/an/an/a
Chinese National Center for Drug Screening
Curated by ChEMBL
Assay Description
Inhibition of recombinant human HDAC3 using Ac-Lys-Tyr-Lys(epsilon-acetyl)-AMC as substrate after 24 hrs by fluorescence assay
ACS Med Chem Lett 5: 628-33 (2014)
Article DOI: 10.1021/ml400470s
BindingDB Entry DOI: 10.7270/Q2V40WRC
Cereblon/Histone deacetylase 6
(Homo sapiens (Human))
BDBM50020889
(CHEMBL3287023 | US9216962, CFH326)
Show SMILES ONC(=O)CCCCNC(=O)c1csc(n1)-c1nccs1
Show InChI InChI=1S/C12H14N4O3S2/c17-9(16-19)3-1-2-4-13-10(18)8-7-21-12(15-8)11-14-5-6-20-11/h5-7,19H,1-4H2,(H,13,18)(H,16,17)
NCI pathway
Reactome pathway
US Patent
n/an/a 1.11E+3n/an/an/an/an/an/a
Shanghai Puyi Chemical Co., Ltd.
US Patent
Assay Description
Enzyme activity of HDAC1,3 is determined using the substrate Ac-Lys-Tyr-Lys(Ac)-AMC while the enzyme activity of HDAC6 is assayed using the substrate...
US Patent US9216962 (2015)
BindingDB Entry DOI: 10.7270/Q2QJ7G3F