BDBM50021058 7-Chloro-1-methyl-5-phenyl-2,3-dihydro-1H-benzo[e][1,4]diazepine::CHEMBL28333::MEDAZEPAM
SMILES: CN1CCN=C(c2ccccc2)c2cc(Cl)ccc12
InChI Key: InChIKey=YLCXGBZIZBEVPZ-UHFFFAOYSA-N
Data: 1 Kd
Activity Spreadsheet -- Enzyme Inhibition Constant Data from BindingDB
Found 1 hit for monomerid = 50021058
Trg + Lig
Ki
nM
ΔG°
kcal/mole
IC50
nM
Kd
nM
EC50/IC50
nM
koff
s-1
kon
M-1s-1
pHTemp
°C
Peripheral-Type Benzodiazepine Receptor
(Rattus norvegicus (rat))
BDBM50021058
(7-Chloro-1-methyl-5-phenyl-2,3-dihydro-1H-benzo[e]...)
Show SMILES CN1CCN=C(c2ccccc2)c2cc(Cl)ccc12 |t:4|
Show InChI InChI=1S/C16H15ClN2/c1-19-10-9-18-16(12-5-3-2-4-6-12)14-11-13(17)7-8-15(14)19/h2-8,11H,9-10H2,1H3
n/an/an/a>10n/an/an/an/an/a
Universit£ di Ferrara
Curated by ChEMBL
Assay Description
Binding affinity constant for peripheral (mitochondrial) Benzodiazepine receptor
J Med Chem 38: 4730-8 (1995)
BindingDB Entry DOI: 10.7270/Q2ZW1MJ8