BDBM50021064 CHEMBL3287614
SMILES: Fc1ccc(cc1)C(=O)N[C@@H]1CCCC[C@@H]1NCc1ccc(Cl)c(Cl)c1
InChI Key: InChIKey=MDTLZKIWQOHXLR-RBUKOAKNSA-N
Data: 1 KI  1 EC50
Activity Spreadsheet -- Enzyme Inhibition Constant Data from BindingDB
Found 2 hits for monomerid = 50021064
Trg + Lig
Ki
nM
ΔG°
kcal/mole
IC50
nM
Kd
nM
EC50/IC50
nM
koff
s-1
kon
M-1s-1
pHTemp
°C
Somatostatin receptor type 3
(Homo sapiens (Human))
BDBM50021064
(CHEMBL3287614)
Show SMILES Fc1ccc(cc1)C(=O)N[C@@H]1CCCC[C@@H]1NCc1ccc(Cl)c(Cl)c1 |r|
Show InChI InChI=1S/C20H21Cl2FN2O/c21-16-10-5-13(11-17(16)22)12-24-18-3-1-2-4-19(18)25-20(26)14-6-8-15(23)9-7-14/h5-11,18-19,24H,1-4,12H2,(H,25,26)/t18-,19+/m0/s1
Reactome pathway
6.80n/an/an/an/an/an/an/an/a
Merck Research Laboratories
Curated by ChEMBL
Assay Description
Displacement of [125I]SS14 from human SST3 expressed in CHO membrane after 60 to 90 mins by scintillation counting
ACS Med Chem Lett 5: 690-5 (2014)
Article DOI: 10.1021/ml500079u
BindingDB Entry DOI: 10.7270/Q22N53V4
Somatostatin receptor type 3
(Homo sapiens (Human))
BDBM50021064
(CHEMBL3287614)
Show SMILES Fc1ccc(cc1)C(=O)N[C@@H]1CCCC[C@@H]1NCc1ccc(Cl)c(Cl)c1 |r|
Show InChI InChI=1S/C20H21Cl2FN2O/c21-16-10-5-13(11-17(16)22)12-24-18-3-1-2-4-19(18)25-20(26)14-6-8-15(23)9-7-14/h5-11,18-19,24H,1-4,12H2,(H,25,26)/t18-,19+/m0/s1
Reactome pathway
n/an/an/an/a 6.10n/an/an/an/a
Merck Research Laboratories
Curated by ChEMBL
Assay Description
Agonist activity at human SST3 expressed in CHO-K1 cells assessed as foreskin-stimulated cAMP accumulation after 45 mins by TR-FRET assay
ACS Med Chem Lett 5: 690-5 (2014)
Article DOI: 10.1021/ml500079u
BindingDB Entry DOI: 10.7270/Q22N53V4