BDBM50021073 CHEMBL3287627
SMILES: Fc1ccc(cc1F)C(=O)N[C@@H]1CCCC[C@@H]1NCc1ccc(Cl)c(Cl)c1
InChI Key: InChIKey=AAZOQKAGKZABTI-RBUKOAKNSA-N
Data: 1 KI  1 EC50
Activity Spreadsheet -- Enzyme Inhibition Constant Data from BindingDB
Found 2 hits for monomerid = 50021073
Trg + Lig
Ki
nM
ΔG°
kcal/mole
IC50
nM
Kd
nM
EC50/IC50
nM
koff
s-1
kon
M-1s-1
pHTemp
°C
Somatostatin receptor type 3
(Homo sapiens (Human))
BDBM50021073
(CHEMBL3287627)
Show SMILES Fc1ccc(cc1F)C(=O)N[C@@H]1CCCC[C@@H]1NCc1ccc(Cl)c(Cl)c1 |r|
Show InChI InChI=1S/C20H20Cl2F2N2O/c21-14-7-5-12(9-15(14)22)11-25-18-3-1-2-4-19(18)26-20(27)13-6-8-16(23)17(24)10-13/h5-10,18-19,25H,1-4,11H2,(H,26,27)/t18-,19+/m0/s1
Reactome pathway
4.5n/an/an/an/an/an/an/an/a
Merck Research Laboratories
Curated by ChEMBL
Assay Description
Displacement of [125I]SS14 from human SST3 expressed in CHO membrane after 60 to 90 mins by scintillation counting
ACS Med Chem Lett 5: 690-5 (2014)
Article DOI: 10.1021/ml500079u
BindingDB Entry DOI: 10.7270/Q22N53V4
Somatostatin receptor type 3
(Homo sapiens (Human))
BDBM50021073
(CHEMBL3287627)
Show SMILES Fc1ccc(cc1F)C(=O)N[C@@H]1CCCC[C@@H]1NCc1ccc(Cl)c(Cl)c1 |r|
Show InChI InChI=1S/C20H20Cl2F2N2O/c21-14-7-5-12(9-15(14)22)11-25-18-3-1-2-4-19(18)26-20(27)13-6-8-16(23)17(24)10-13/h5-10,18-19,25H,1-4,11H2,(H,26,27)/t18-,19+/m0/s1
Reactome pathway
n/an/an/an/a 4.5n/an/an/an/a
Merck Research Laboratories
Curated by ChEMBL
Assay Description
Agonist activity at human SST3 expressed in CHO-K1 cells assessed as foreskin-stimulated cAMP accumulation after 45 mins by TR-FRET assay
ACS Med Chem Lett 5: 690-5 (2014)
Article DOI: 10.1021/ml500079u
BindingDB Entry DOI: 10.7270/Q22N53V4