null
SMILES: COc1cc2c(Oc3ccc(NC(=O)c4nn(-c5ccc(F)c(F)c5)c(=O)cc4C)cc3F)ccnc2cc1OCCCN1CCOCC1
InChI Key: InChIKey=FPBYLFNVVGRAHD-UHFFFAOYSA-N
Activity Spreadsheet -- Enzyme Inhibition Constant Data from BindingDB
Found 1 hit for monomerid = 50021578
Trg + Lig
Ki
nM
ΔG°
kcal/mole
IC50
nM
Kd
nM
EC50/IC50
nM
koff
s-1
kon
M-1s-1
pHTemp
°C
Hepatocyte growth factor receptor
(Homo sapiens (Human))
BDBM50021578
(CHEMBL3290896)
Show SMILES COc1cc2c(Oc3ccc(NC(=O)c4nn(-c5ccc(F)c(F)c5)c(=O)cc4C)cc3F)ccnc2cc1OCCCN1CCOCC1
Show InChI InChI=1S/C35H32F3N5O6/c1-21-16-33(44)43(23-5-6-25(36)26(37)18-23)41-34(21)35(45)40-22-4-7-30(27(38)17-22)49-29-8-9-39-28-20-32(31(46-2)19-24(28)29)48-13-3-10-42-11-14-47-15-12-42/h4-9,16-20H,3,10-15H2,1-2H3,(H,40,45)
n/an/a 9.20n/an/an/an/an/an/a
Key Laboratory of Structure-Based Drug Design and Discovery (Shenyang Pharmaceutical University)
Curated by ChEMBL
Assay Description
Inhibition of c-Met (unknown origin) using poly (Glu,Tyr)4:1 as substrate by homogeneous time-resolved fluorescence assay
Eur J Med Chem 83: 581-93 (2014)
Article DOI: 10.1016/j.ejmech.2014.06.068
BindingDB Entry DOI: 10.7270/Q2R78GTF