BDBM50021622 CHEMBL3297767
SMILES: CN1CCN(C[C@@H](NC(=O)C[C@H]2CNC(=O)c3cc(cn23)-c2cccc(Cl)c2)C(C)(C)C)CC1
InChI Key: InChIKey=QUKALHWYSNHRNQ-JTHBVZDNSA-N
Data: 2 IC50
Activity Spreadsheet -- Enzyme Inhibition Constant Data from BindingDB
Found 2 hits for monomerid = 50021622
Trg + Lig
Ki
nM
ΔG°
kcal/mole
IC50
nM
Kd
nM
EC50/IC50
nM
koff
s-1
kon
M-1s-1
pHTemp
°C
Serine/threonine-protein kinase pim-1
(Homo sapiens (Human))
BDBM50021622
(CHEMBL3297767)
Show SMILES CN1CCN(C[C@@H](NC(=O)C[C@H]2CNC(=O)c3cc(cn23)-c2cccc(Cl)c2)C(C)(C)C)CC1 |r|
Show InChI InChI=1S/C26H36ClN5O2/c1-26(2,3)23(17-31-10-8-30(4)9-11-31)29-24(33)14-21-15-28-25(34)22-13-19(16-32(21)22)18-6-5-7-20(27)12-18/h5-7,12-13,16,21,23H,8-11,14-15,17H2,1-4H3,(H,28,34)(H,29,33)/t21-,23+/m0/s1
n/an/a 5n/an/an/an/an/an/a
Nerviano Medical Sciences
Curated by ChEMBL
Assay Description
Inhibition of human PIM1 using ARK-RERTYSFGHHA as substrate incubated for 60 mins prior to substrate addition by topcount scintillation counting anal...
Bioorg Med Chem 21: 7364-80 (2013)
Article DOI: 10.1016/j.bmc.2013.09.054
BindingDB Entry DOI: 10.7270/Q23F4R7S
Serine/threonine-protein kinase pim-2
(Homo sapiens (Human))
BDBM50021622
(CHEMBL3297767)
Show SMILES CN1CCN(C[C@@H](NC(=O)C[C@H]2CNC(=O)c3cc(cn23)-c2cccc(Cl)c2)C(C)(C)C)CC1 |r|
Show InChI InChI=1S/C26H36ClN5O2/c1-26(2,3)23(17-31-10-8-30(4)9-11-31)29-24(33)14-21-15-28-25(34)22-13-19(16-32(21)22)18-6-5-7-20(27)12-18/h5-7,12-13,16,21,23H,8-11,14-15,17H2,1-4H3,(H,28,34)(H,29,33)/t21-,23+/m0/s1
n/an/a 262n/an/an/an/an/an/a
Nerviano Medical Sciences
Curated by ChEMBL
Assay Description
Inhibition of human PIM2 using ARK-RERTYSFGHHA as substrate incubated for 60 mins prior to substrate addition by topcount scintillation counting anal...
Bioorg Med Chem 21: 7364-80 (2013)
Article DOI: 10.1016/j.bmc.2013.09.054
BindingDB Entry DOI: 10.7270/Q23F4R7S