BDBM50021633 CHEMBL3298562
SMILES: CC(C)(C)CNC(=O)CC1CNC(=O)c2cc(cn12)-c1cccc(OC(F)(F)F)c1
InChI Key: InChIKey=NFMSNXYDDWETPY-UHFFFAOYSA-N
Data: 1 IC50
Activity Spreadsheet -- Enzyme Inhibition Constant Data from BindingDB
Found 1 hit for monomerid = 50021633
Trg + Lig
Ki
nM
ΔG°
kcal/mole
IC50
nM
Kd
nM
EC50/IC50
nM
koff
s-1
kon
M-1s-1
pHTemp
°C
Serine/threonine-protein kinase pim-1
(Homo sapiens (Human))
BDBM50021633
(CHEMBL3298562)
Show SMILES CC(C)(C)CNC(=O)CC1CNC(=O)c2cc(cn12)-c1cccc(OC(F)(F)F)c1
Show InChI InChI=1S/C21H24F3N3O3/c1-20(2,3)12-26-18(28)9-15-10-25-19(29)17-8-14(11-27(15)17)13-5-4-6-16(7-13)30-21(22,23)24/h4-8,11,15H,9-10,12H2,1-3H3,(H,25,29)(H,26,28)
n/an/a 1.28E+3n/an/an/an/an/an/a
Nerviano Medical Sciences
Curated by ChEMBL
Assay Description
Inhibition of human PIM1 using ARK-RERTYSFGHHA as substrate incubated for 60 mins prior to substrate addition by topcount scintillation counting anal...
Bioorg Med Chem 21: 7364-80 (2013)
Article DOI: 10.1016/j.bmc.2013.09.054
BindingDB Entry DOI: 10.7270/Q23F4R7S