BDBM50021639 CHEMBL3298820
SMILES: Fc1cccc(c1)-c1cc2C(=O)NCC(CC(=O)NCC3CCCCC3)n2c1
InChI Key: InChIKey=DGBIYWPBTYDPDM-UHFFFAOYSA-N
Data: 2 IC50
Activity Spreadsheet -- Enzyme Inhibition Constant Data from BindingDB
Found 2 hits for monomerid = 50021639
Trg + Lig
Ki
nM
ΔG°
kcal/mole
IC50
nM
Kd
nM
EC50/IC50
nM
koff
s-1
kon
M-1s-1
pHTemp
°C
Serine/threonine-protein kinase pim-2
(Homo sapiens (Human))
BDBM50021639
(CHEMBL3298820)
Show SMILES Fc1cccc(c1)-c1cc2C(=O)NCC(CC(=O)NCC3CCCCC3)n2c1
Show InChI InChI=1S/C22H26FN3O2/c23-18-8-4-7-16(9-18)17-10-20-22(28)25-13-19(26(20)14-17)11-21(27)24-12-15-5-2-1-3-6-15/h4,7-10,14-15,19H,1-3,5-6,11-13H2,(H,24,27)(H,25,28)
n/an/a 2.46E+3n/an/an/an/an/an/a
Nerviano Medical Sciences
Curated by ChEMBL
Assay Description
Inhibition of human PIM2 using ARK-RERTYSFGHHA as substrate incubated for 60 mins prior to substrate addition by topcount scintillation counting anal...
Bioorg Med Chem 21: 7364-80 (2013)
Article DOI: 10.1016/j.bmc.2013.09.054
BindingDB Entry DOI: 10.7270/Q23F4R7S
Serine/threonine-protein kinase pim-1
(Homo sapiens (Human))
BDBM50021639
(CHEMBL3298820)
Show SMILES Fc1cccc(c1)-c1cc2C(=O)NCC(CC(=O)NCC3CCCCC3)n2c1
Show InChI InChI=1S/C22H26FN3O2/c23-18-8-4-7-16(9-18)17-10-20-22(28)25-13-19(26(20)14-17)11-21(27)24-12-15-5-2-1-3-6-15/h4,7-10,14-15,19H,1-3,5-6,11-13H2,(H,24,27)(H,25,28)
n/an/a 73n/an/an/an/an/an/a
Nerviano Medical Sciences
Curated by ChEMBL
Assay Description
Inhibition of human PIM1 using ARK-RERTYSFGHHA as substrate incubated for 60 mins prior to substrate addition by topcount scintillation counting anal...
Bioorg Med Chem 21: 7364-80 (2013)
Article DOI: 10.1016/j.bmc.2013.09.054
BindingDB Entry DOI: 10.7270/Q23F4R7S