null
SMILES: Clc1nccc(n1)-c1cc2C(=O)NCC(CC(=O)NCC3CCCCC3)n2c1
InChI Key: InChIKey=YJCCOUKVNAPQTP-UHFFFAOYSA-N
Activity Spreadsheet -- Enzyme Inhibition Constant Data from BindingDB
Found 2 hits for monomerid = 50021641
Trg + Lig
Ki
nM
ΔG°
kcal/mole
IC50
nM
Kd
nM
EC50/IC50
nM
koff
s-1
kon
M-1s-1
pHTemp
°C
Serine/threonine-protein kinase pim-2
(Homo sapiens (Human))
BDBM50021641
(CHEMBL3298822)
Show SMILES Clc1nccc(n1)-c1cc2C(=O)NCC(CC(=O)NCC3CCCCC3)n2c1
Show InChI InChI=1S/C20H24ClN5O2/c21-20-22-7-6-16(25-20)14-8-17-19(28)24-11-15(26(17)12-14)9-18(27)23-10-13-4-2-1-3-5-13/h6-8,12-13,15H,1-5,9-11H2,(H,23,27)(H,24,28)
n/an/a 1.32E+3n/an/an/an/an/an/a
Nerviano Medical Sciences
Curated by ChEMBL
Assay Description
Inhibition of human PIM2 using ARK-RERTYSFGHHA as substrate incubated for 60 mins prior to substrate addition by topcount scintillation counting anal...
Bioorg Med Chem 21: 7364-80 (2013)
Article DOI: 10.1016/j.bmc.2013.09.054
BindingDB Entry DOI: 10.7270/Q23F4R7S
Serine/threonine-protein kinase pim-1
(Homo sapiens (Human))
BDBM50021641
(CHEMBL3298822)
Show SMILES Clc1nccc(n1)-c1cc2C(=O)NCC(CC(=O)NCC3CCCCC3)n2c1
Show InChI InChI=1S/C20H24ClN5O2/c21-20-22-7-6-16(25-20)14-8-17-19(28)24-11-15(26(17)12-14)9-18(27)23-10-13-4-2-1-3-5-13/h6-8,12-13,15H,1-5,9-11H2,(H,23,27)(H,24,28)
n/an/a 33n/an/an/an/an/an/a
Nerviano Medical Sciences
Curated by ChEMBL
Assay Description
Inhibition of human PIM1 using ARK-RERTYSFGHHA as substrate incubated for 60 mins prior to substrate addition by topcount scintillation counting anal...
Bioorg Med Chem 21: 7364-80 (2013)
Article DOI: 10.1016/j.bmc.2013.09.054
BindingDB Entry DOI: 10.7270/Q23F4R7S