BDBM50021646 CHEMBL3298888
SMILES: Cc1ccc(Cl)cc1-c1cc2C(=O)NCC(CC(=O)NCc3ccco3)n2c1
InChI Key: InChIKey=WGVAYUCPTIUNJS-UHFFFAOYSA-N
Data: 2 IC50
Activity Spreadsheet -- Enzyme Inhibition Constant Data from BindingDB
Found 2 hits for monomerid = 50021646
Trg + Lig
Ki
nM
ΔG°
kcal/mole
IC50
nM
Kd
nM
EC50/IC50
nM
koff
s-1
kon
M-1s-1
pHTemp
°C
Serine/threonine-protein kinase pim-2
(Homo sapiens (Human))
BDBM50021646
(CHEMBL3298888)
Show SMILES Cc1ccc(Cl)cc1-c1cc2C(=O)NCC(CC(=O)NCc3ccco3)n2c1
Show InChI InChI=1S/C21H20ClN3O3/c1-13-4-5-15(22)8-18(13)14-7-19-21(27)24-10-16(25(19)12-14)9-20(26)23-11-17-3-2-6-28-17/h2-8,12,16H,9-11H2,1H3,(H,23,26)(H,24,27)
n/an/a>5.00E+3n/an/an/an/an/an/a
Nerviano Medical Sciences
Curated by ChEMBL
Assay Description
Inhibition of human PIM2 using ARK-RERTYSFGHHA as substrate incubated for 60 mins prior to substrate addition by topcount scintillation counting anal...
Bioorg Med Chem 21: 7364-80 (2013)
Article DOI: 10.1016/j.bmc.2013.09.054
BindingDB Entry DOI: 10.7270/Q23F4R7S
Serine/threonine-protein kinase pim-1
(Homo sapiens (Human))
BDBM50021646
(CHEMBL3298888)
Show SMILES Cc1ccc(Cl)cc1-c1cc2C(=O)NCC(CC(=O)NCc3ccco3)n2c1
Show InChI InChI=1S/C21H20ClN3O3/c1-13-4-5-15(22)8-18(13)14-7-19-21(27)24-10-16(25(19)12-14)9-20(26)23-11-17-3-2-6-28-17/h2-8,12,16H,9-11H2,1H3,(H,23,26)(H,24,27)
n/an/a>5.00E+3n/an/an/an/an/an/a
Nerviano Medical Sciences
Curated by ChEMBL
Assay Description
Inhibition of human PIM1 using ARK-RERTYSFGHHA as substrate incubated for 60 mins prior to substrate addition by topcount scintillation counting anal...
Bioorg Med Chem 21: 7364-80 (2013)
Article DOI: 10.1016/j.bmc.2013.09.054
BindingDB Entry DOI: 10.7270/Q23F4R7S