BDBM50021710 CHEMBL3298309
SMILES: CC[C@@H](NC(=O)N1CCc2cnc(N[C@@H](C)CO)nc2C1)c1ccc(F)c(F)c1
InChI Key: InChIKey=KZHHXCCLGNIRRE-YVEFUNNKSA-N
Data: 3 IC50
Activity Spreadsheet -- Enzyme Inhibition Constant Data from BindingDB
Found 3 hits for monomerid = 50021710
Trg + Lig
Ki
nM
ΔG°
kcal/mole
IC50
nM
Kd
nM
EC50/IC50
nM
koff
s-1
kon
M-1s-1
pHTemp
°C
Mitogen-activated protein kinase 1
(Homo sapiens (Human))
BDBM50021710
(CHEMBL3298309)
Show SMILES CC[C@@H](NC(=O)N1CCc2cnc(N[C@@H](C)CO)nc2C1)c1ccc(F)c(F)c1 |r|
Show InChI InChI=1S/C20H25F2N5O2/c1-3-17(13-4-5-15(21)16(22)8-13)26-20(29)27-7-6-14-9-23-19(24-12(2)11-28)25-18(14)10-27/h4-5,8-9,12,17,28H,3,6-7,10-11H2,1-2H3,(H,26,29)(H,23,24,25)/t12-,17+/m0/s1
NCI pathway
Reactome pathway
n/an/a 51n/an/an/an/an/an/a
Array BioPharma Inc
Curated by ChEMBL
Assay Description
Inhibition of ERK2 in human HepG2 cells assessed as P90RSK phosphorylation at Ser380 after 1.5 hrs by fluorescence assay
Bioorg Med Chem Lett 24: 2635-9 (2014)
Article DOI: 10.1016/j.bmcl.2014.04.068
BindingDB Entry DOI: 10.7270/Q2FQ9Z54
Mitogen-activated protein kinase 1
(Homo sapiens (Human))
BDBM50021710
(CHEMBL3298309)
Show SMILES CC[C@@H](NC(=O)N1CCc2cnc(N[C@@H](C)CO)nc2C1)c1ccc(F)c(F)c1 |r|
Show InChI InChI=1S/C20H25F2N5O2/c1-3-17(13-4-5-15(21)16(22)8-13)26-20(29)27-7-6-14-9-23-19(24-12(2)11-28)25-18(14)10-27/h4-5,8-9,12,17,28H,3,6-7,10-11H2,1-2H3,(H,26,29)(H,23,24,25)/t12-,17+/m0/s1
NCI pathway
Reactome pathway
n/an/a 3n/an/an/an/an/an/a
Array BioPharma Inc
Curated by ChEMBL
Assay Description
Inhibition of human recombinant N-terminal 6-His-tagged ERK2 expressed in Escherichia coli using S/T17 as substrate after 30 mins by spectrophotometr...
Bioorg Med Chem Lett 24: 2635-9 (2014)
Article DOI: 10.1016/j.bmcl.2014.04.068
BindingDB Entry DOI: 10.7270/Q2FQ9Z54
Cyclin-dependent kinase 2
(Homo sapiens (Human))
BDBM50021710
(CHEMBL3298309)
Show SMILES CC[C@@H](NC(=O)N1CCc2cnc(N[C@@H](C)CO)nc2C1)c1ccc(F)c(F)c1 |r|
Show InChI InChI=1S/C20H25F2N5O2/c1-3-17(13-4-5-15(21)16(22)8-13)26-20(29)27-7-6-14-9-23-19(24-12(2)11-28)25-18(14)10-27/h4-5,8-9,12,17,28H,3,6-7,10-11H2,1-2H3,(H,26,29)(H,23,24,25)/t12-,17+/m0/s1
NCI pathway
Reactome pathway
n/an/a 13n/an/an/an/an/an/a
Array BioPharma Inc
Curated by ChEMBL
Assay Description
Inhibition of Cdk2 (unknown origin)
Bioorg Med Chem Lett 24: 2635-9 (2014)
Article DOI: 10.1016/j.bmcl.2014.04.068
BindingDB Entry DOI: 10.7270/Q2FQ9Z54