BDBM50021764 CHEMBL3298568
SMILES: CCC(C)Nc1ncc2CCN(Cc2n1)C(=O)N[C@H](CO)c1ccc(F)c(Cl)c1
InChI Key: InChIKey=INCTVHPQHISUOB-VMHBGOFLSA-N
Data: 2 IC50
Activity Spreadsheet -- Enzyme Inhibition Constant Data from BindingDB
Found 2 hits for monomerid = 50021764
Trg + Lig
Ki
nM
ΔG°
kcal/mole
IC50
nM
Kd
nM
EC50/IC50
nM
koff
s-1
kon
M-1s-1
pHTemp
°C
Mitogen-activated protein kinase 1
(Homo sapiens (Human))
BDBM50021764
(CHEMBL3298568)
Show SMILES CCC(C)Nc1ncc2CCN(Cc2n1)C(=O)N[C@H](CO)c1ccc(F)c(Cl)c1 |r|
Show InChI InChI=1S/C20H25ClFN5O2/c1-3-12(2)24-19-23-9-14-6-7-27(10-17(14)25-19)20(29)26-18(11-28)13-4-5-16(22)15(21)8-13/h4-5,8-9,12,18,28H,3,6-7,10-11H2,1-2H3,(H,26,29)(H,23,24,25)/t12?,18-/m1/s1
NCI pathway
Reactome pathway
n/an/a 513n/an/an/an/an/an/a
Array BioPharma Inc
Curated by ChEMBL
Assay Description
Inhibition of ERK2 in human HepG2 cells assessed as P90RSK phosphorylation at Ser380 after 1.5 hrs by fluorescence assay
Bioorg Med Chem Lett 24: 2635-9 (2014)
Article DOI: 10.1016/j.bmcl.2014.04.068
BindingDB Entry DOI: 10.7270/Q2FQ9Z54
Mitogen-activated protein kinase 1
(Homo sapiens (Human))
BDBM50021764
(CHEMBL3298568)
Show SMILES CCC(C)Nc1ncc2CCN(Cc2n1)C(=O)N[C@H](CO)c1ccc(F)c(Cl)c1 |r|
Show InChI InChI=1S/C20H25ClFN5O2/c1-3-12(2)24-19-23-9-14-6-7-27(10-17(14)25-19)20(29)26-18(11-28)13-4-5-16(22)15(21)8-13/h4-5,8-9,12,18,28H,3,6-7,10-11H2,1-2H3,(H,26,29)(H,23,24,25)/t12?,18-/m1/s1
NCI pathway
Reactome pathway
n/an/a 10n/an/an/an/an/an/a
Array BioPharma Inc
Curated by ChEMBL
Assay Description
Inhibition of human recombinant N-terminal 6-His-tagged ERK2 expressed in Escherichia coli using S/T17 as substrate after 30 mins by spectrophotometr...
Bioorg Med Chem Lett 24: 2635-9 (2014)
Article DOI: 10.1016/j.bmcl.2014.04.068
BindingDB Entry DOI: 10.7270/Q2FQ9Z54