BDBM50021820 CHEMBL3297778
SMILES: Fc1ccc(Oc2nccc3[nH]ccc23)cc1
InChI Key: InChIKey=ISIATOZGACZZRA-UHFFFAOYSA-N
Data: 7 IC50
Activity Spreadsheet -- Enzyme Inhibition Constant Data from BindingDB
Found 7 hits for monomerid = 50021820
Trg + Lig
Ki
nM
ΔG°
kcal/mole
IC50
nM
Kd
nM
EC50/IC50
nM
koff
s-1
kon
M-1s-1
pHTemp
°C
Transient receptor potential cation channel subfamily A member 1
(Homo sapiens (Human))
BDBM50021820
(CHEMBL3297778)
Show SMILES Fc1ccc(Oc2nccc3[nH]ccc23)cc1
Show InChI InChI=1S/C13H9FN2O/c14-9-1-3-10(4-2-9)17-13-11-5-7-15-12(11)6-8-16-13/h1-8,15H
n/an/a 310n/an/an/an/an/an/a
AstraZeneca
Curated by ChEMBL
Assay Description
Antagonist activity at human TRPA1 expressed in HEK293-TREx cells assessed as intracellular level after 48 of 72 hrs by Fluo-4 NW staining-based fluo...
Bioorg Med Chem Lett 24: 3199-203 (2014)
Article DOI: 10.1016/j.bmcl.2014.04.045
BindingDB Entry DOI: 10.7270/Q2668FRT
Transient receptor potential cation channel subfamily A member 1
(Rattus norvegicus)
BDBM50021820
(CHEMBL3297778)
Show SMILES Fc1ccc(Oc2nccc3[nH]ccc23)cc1
Show InChI InChI=1S/C13H9FN2O/c14-9-1-3-10(4-2-9)17-13-11-5-7-15-12(11)6-8-16-13/h1-8,15H
n/an/a 1.20E+3n/an/an/an/an/an/a
AstraZeneca
Curated by ChEMBL
Assay Description
Antagonist activity at rat TRPA1 expressed in HEK293-TREx cells assessed as intracellular level after 48 of 72 hrs by Fluo-4 NW staining-based fluore...
Bioorg Med Chem Lett 24: 3199-203 (2014)
Article DOI: 10.1016/j.bmcl.2014.04.045
BindingDB Entry DOI: 10.7270/Q2668FRT
Cytochrome P450 1A
(Homo sapiens (Human))
BDBM50021820
(CHEMBL3297778)
Show SMILES Fc1ccc(Oc2nccc3[nH]ccc23)cc1
Show InChI InChI=1S/C13H9FN2O/c14-9-1-3-10(4-2-9)17-13-11-5-7-15-12(11)6-8-16-13/h1-8,15H
Reactome pathway
n/an/a>2.00E+4n/an/an/an/an/an/a
AstraZeneca
Curated by ChEMBL
Assay Description
Inhibition of CYP1A2 in human liver microsomes by LC-MS/MS/competitive screening assay
Bioorg Med Chem Lett 24: 3199-203 (2014)
Article DOI: 10.1016/j.bmcl.2014.04.045
BindingDB Entry DOI: 10.7270/Q2668FRT
Cytochrome P450 3A4
(Homo sapiens (Human))
BDBM50021820
(CHEMBL3297778)
Show SMILES Fc1ccc(Oc2nccc3[nH]ccc23)cc1
Show InChI InChI=1S/C13H9FN2O/c14-9-1-3-10(4-2-9)17-13-11-5-7-15-12(11)6-8-16-13/h1-8,15H
Reactome pathway
n/an/a>2.00E+4n/an/an/an/an/an/a
AstraZeneca
Curated by ChEMBL
Assay Description
Inhibition of CYP3A4 in human liver microsomes by LC-MS/MS/competitive screening assay
Bioorg Med Chem Lett 24: 3199-203 (2014)
Article DOI: 10.1016/j.bmcl.2014.04.045
BindingDB Entry DOI: 10.7270/Q2668FRT
Cytochrome P450 2C19
(Homo sapiens (Human))
BDBM50021820
(CHEMBL3297778)
Show SMILES Fc1ccc(Oc2nccc3[nH]ccc23)cc1
Show InChI InChI=1S/C13H9FN2O/c14-9-1-3-10(4-2-9)17-13-11-5-7-15-12(11)6-8-16-13/h1-8,15H
Reactome pathway
n/an/a>2.00E+4n/an/an/an/an/an/a
AstraZeneca
Curated by ChEMBL
Assay Description
Inhibition of CYP2C19 in human liver microsomes by LC-MS/MS/competitive screening assay
Bioorg Med Chem Lett 24: 3199-203 (2014)
Article DOI: 10.1016/j.bmcl.2014.04.045
BindingDB Entry DOI: 10.7270/Q2668FRT
Cytochrome P450 2D6
(Homo sapiens (Human))
BDBM50021820
(CHEMBL3297778)
Show SMILES Fc1ccc(Oc2nccc3[nH]ccc23)cc1
Show InChI InChI=1S/C13H9FN2O/c14-9-1-3-10(4-2-9)17-13-11-5-7-15-12(11)6-8-16-13/h1-8,15H
n/an/a>2.00E+4n/an/an/an/an/an/a
AstraZeneca
Curated by ChEMBL
Assay Description
Inhibition of CYP2D6 in human liver microsomes by LC-MS/MS/competitive screening assay
Bioorg Med Chem Lett 24: 3199-203 (2014)
Article DOI: 10.1016/j.bmcl.2014.04.045
BindingDB Entry DOI: 10.7270/Q2668FRT
Cytochrome P450 2C9
(Homo sapiens (Human))
BDBM50021820
(CHEMBL3297778)
Show SMILES Fc1ccc(Oc2nccc3[nH]ccc23)cc1
Show InChI InChI=1S/C13H9FN2O/c14-9-1-3-10(4-2-9)17-13-11-5-7-15-12(11)6-8-16-13/h1-8,15H
Reactome pathway
n/an/a>2.00E+4n/an/an/an/an/an/a
AstraZeneca
Curated by ChEMBL
Assay Description
Inhibition of CYP2C9 in human liver microsomes by LC-MS/MS/competitive screening assay
Bioorg Med Chem Lett 24: 3199-203 (2014)
Article DOI: 10.1016/j.bmcl.2014.04.045
BindingDB Entry DOI: 10.7270/Q2668FRT