BDBM50021873 CHEMBL3298330
SMILES: NCCCCOc1ccc(Nc2ccc(CCNC[C@H](O)c3ccc(O)c4[nH]c(=O)ccc34)cc2)cc1
InChI Key: InChIKey=OIDYEIRWMIDJOH-MHZLTWQESA-N
Data: 1 KI  4 EC50
Activity Spreadsheet -- Enzyme Inhibition Constant Data from BindingDB
Found 5 hits for monomerid = 50021873
Trg + Lig
Ki
nM
ΔG°
kcal/mole
IC50
nM
Kd
nM
EC50/IC50
nM
koff
s-1
kon
M-1s-1
pHTemp
°C
Beta-2 adrenergic receptor
(Homo sapiens (Human))
BDBM50021873
(CHEMBL3298330)
Show SMILES NCCCCOc1ccc(Nc2ccc(CCNC[C@H](O)c3ccc(O)c4[nH]c(=O)ccc34)cc2)cc1 |r|
Show InChI InChI=1S/C29H34N4O4/c30-16-1-2-18-37-23-9-7-22(8-10-23)32-21-5-3-20(4-6-21)15-17-31-19-27(35)24-11-13-26(34)29-25(24)12-14-28(36)33-29/h3-14,27,31-32,34-35H,1-2,15-19,30H2,(H,33,36)/t27-/m0/s1
Reactome pathway
5n/an/an/an/an/an/an/an/a
Theravance, Inc.
Curated by ChEMBL
Assay Description
Displacement of [3H]dihydroalprenolol from human beta2 adrenergic receptor expressing cell membrane by competition binding assay
Bioorg Med Chem Lett 24: 2871-6 (2014)
Article DOI: 10.1016/j.bmcl.2014.04.095
BindingDB Entry DOI: 10.7270/Q22J6DFT
Beta-3 adrenergic receptor
(Homo sapiens (Human))
BDBM50021873
(CHEMBL3298330)
Show SMILES NCCCCOc1ccc(Nc2ccc(CCNC[C@H](O)c3ccc(O)c4[nH]c(=O)ccc34)cc2)cc1 |r|
Show InChI InChI=1S/C29H34N4O4/c30-16-1-2-18-37-23-9-7-22(8-10-23)32-21-5-3-20(4-6-21)15-17-31-19-27(35)24-11-13-26(34)29-25(24)12-14-28(36)33-29/h3-14,27,31-32,34-35H,1-2,15-19,30H2,(H,33,36)/t27-/m0/s1
Reactome pathway
n/an/an/an/a 40n/an/an/an/a
Theravance, Inc.
Curated by ChEMBL
Assay Description
Agonist activity at human beta3 adrenergic receptor expressed in cells by cAMP accumulation assay
Bioorg Med Chem Lett 24: 2871-6 (2014)
Article DOI: 10.1016/j.bmcl.2014.04.095
BindingDB Entry DOI: 10.7270/Q22J6DFT
Beta-2 adrenergic receptor
(Homo sapiens (Human))
BDBM50021873
(CHEMBL3298330)
Show SMILES NCCCCOc1ccc(Nc2ccc(CCNC[C@H](O)c3ccc(O)c4[nH]c(=O)ccc34)cc2)cc1 |r|
Show InChI InChI=1S/C29H34N4O4/c30-16-1-2-18-37-23-9-7-22(8-10-23)32-21-5-3-20(4-6-21)15-17-31-19-27(35)24-11-13-26(34)29-25(24)12-14-28(36)33-29/h3-14,27,31-32,34-35H,1-2,15-19,30H2,(H,33,36)/t27-/m0/s1
Reactome pathway
n/an/an/an/a 0.126n/an/an/an/a
Theravance, Inc.
Curated by ChEMBL
Assay Description
Agonist activity at human beta2 adrenergic receptor expressed in cells by cAMP accumulation assay
Bioorg Med Chem Lett 24: 2871-6 (2014)
Article DOI: 10.1016/j.bmcl.2014.04.095
BindingDB Entry DOI: 10.7270/Q22J6DFT
Beta-2 adrenergic receptor
(Homo sapiens (Human))
BDBM50021873
(CHEMBL3298330)
Show SMILES NCCCCOc1ccc(Nc2ccc(CCNC[C@H](O)c3ccc(O)c4[nH]c(=O)ccc34)cc2)cc1 |r|
Show InChI InChI=1S/C29H34N4O4/c30-16-1-2-18-37-23-9-7-22(8-10-23)32-21-5-3-20(4-6-21)15-17-31-19-27(35)24-11-13-26(34)29-25(24)12-14-28(36)33-29/h3-14,27,31-32,34-35H,1-2,15-19,30H2,(H,33,36)/t27-/m0/s1
Reactome pathway
n/an/an/an/a 0.631n/an/an/an/a
Theravance, Inc.
Curated by ChEMBL
Assay Description
Agonist activity at human beta2 adrenergic receptor in human BEAS-2B cells by cAMP accumulation assay
Bioorg Med Chem Lett 24: 2871-6 (2014)
Article DOI: 10.1016/j.bmcl.2014.04.095
BindingDB Entry DOI: 10.7270/Q22J6DFT
Beta-1 adrenergic receptor
(Homo sapiens (Human))
BDBM50021873
(CHEMBL3298330)
Show SMILES NCCCCOc1ccc(Nc2ccc(CCNC[C@H](O)c3ccc(O)c4[nH]c(=O)ccc34)cc2)cc1 |r|
Show InChI InChI=1S/C29H34N4O4/c30-16-1-2-18-37-23-9-7-22(8-10-23)32-21-5-3-20(4-6-21)15-17-31-19-27(35)24-11-13-26(34)29-25(24)12-14-28(36)33-29/h3-14,27,31-32,34-35H,1-2,15-19,30H2,(H,33,36)/t27-/m0/s1
Reactome pathway
n/an/an/an/a 7.90n/an/an/an/a
Theravance, Inc.
Curated by ChEMBL
Assay Description
Agonist activity at human beta1 adrenergic receptor expressed in cells by cAMP accumulation assay
Bioorg Med Chem Lett 24: 2871-6 (2014)
Article DOI: 10.1016/j.bmcl.2014.04.095
BindingDB Entry DOI: 10.7270/Q22J6DFT