BDBM50021986 CHEMBL3298904
SMILES: [H][C@@]12CCC[C@H](N3CCCC3)[C@@]1([H])N(CCN2Cc1ccccc1)C(=O)Cc1ccccc1
InChI Key: InChIKey=FTILCKRWMSJYSB-ZWEKWIFMSA-N
Data: 1 KI  2 IC50
Activity Spreadsheet -- Enzyme Inhibition Constant Data from BindingDB
Found 3 hits for monomerid = 50021986
Trg + Lig
Ki
nM
ΔG°
kcal/mole
IC50
nM
Kd
nM
EC50/IC50
nM
koff
s-1
kon
M-1s-1
pHTemp
°C
Kappa-type opioid receptor
(Cavia porcellus (domestic guinea pig))
BDBM50021986
(CHEMBL3298904)
Show SMILES [H][C@@]12CCC[C@H](N3CCCC3)[C@@]1([H])N(CCN2Cc1ccccc1)C(=O)Cc1ccccc1 |r|
Show InChI InChI=1S/C27H35N3O/c31-26(20-22-10-3-1-4-11-22)30-19-18-29(21-23-12-5-2-6-13-23)25-15-9-14-24(27(25)30)28-16-7-8-17-28/h1-6,10-13,24-25,27H,7-9,14-21H2/t24-,25+,27+/m0/s1
129n/an/an/an/an/an/an/an/a
Institut f£r Pharmazeutische und Medizinische Chemie der Universit£t M£nster
Curated by ChEMBL
Assay Description
Displacement of [3H]U-69593 from kappa-opoid receptor in guinea pig brain membrane
Bioorg Med Chem 22: 3316-24 (2014)
Article DOI: 10.1016/j.bmc.2014.04.054
BindingDB Entry DOI: 10.7270/Q2DR2X2R
Mu-type opioid receptor
(Homo sapiens (Human))
BDBM50021986
(CHEMBL3298904)
Show SMILES [H][C@@]12CCC[C@H](N3CCCC3)[C@@]1([H])N(CCN2Cc1ccccc1)C(=O)Cc1ccccc1 |r|
Show InChI InChI=1S/C27H35N3O/c31-26(20-22-10-3-1-4-11-22)30-19-18-29(21-23-12-5-2-6-13-23)25-15-9-14-24(27(25)30)28-16-7-8-17-28/h1-6,10-13,24-25,27H,7-9,14-21H2/t24-,25+,27+/m0/s1
NCI pathway
Reactome pathway
n/an/a>1.00E+4n/an/an/an/an/an/a
Institut f£r Pharmazeutische und Medizinische Chemie der Universit£t M£nster
Curated by ChEMBL
Assay Description
Displacement of [3H]-naloxone from human mu-opioid receptor transfected in CHO-K1 cell by scintillation counting
Bioorg Med Chem 22: 3316-24 (2014)
Article DOI: 10.1016/j.bmc.2014.04.054
BindingDB Entry DOI: 10.7270/Q2DR2X2R
Delta-type opioid receptor
(Homo sapiens (Human))
BDBM50021986
(CHEMBL3298904)
Show SMILES [H][C@@]12CCC[C@H](N3CCCC3)[C@@]1([H])N(CCN2Cc1ccccc1)C(=O)Cc1ccccc1 |r|
Show InChI InChI=1S/C27H35N3O/c31-26(20-22-10-3-1-4-11-22)30-19-18-29(21-23-12-5-2-6-13-23)25-15-9-14-24(27(25)30)28-16-7-8-17-28/h1-6,10-13,24-25,27H,7-9,14-21H2/t24-,25+,27+/m0/s1
Reactome pathway
n/an/a>1.00E+4n/an/an/an/an/an/a
Institut f£r Pharmazeutische und Medizinische Chemie der Universit£t M£nster
Curated by ChEMBL
Assay Description
Displacement of [3H]-deltorphin 2 from human delta-opioid receptor transfected in CHO-K1 cell by scintillation counting
Bioorg Med Chem 22: 3316-24 (2014)
Article DOI: 10.1016/j.bmc.2014.04.054
BindingDB Entry DOI: 10.7270/Q2DR2X2R