BDBM50022261 (5-Oxo-10,11-dihydro-5H-dibenzo[a,d]cyclohepten-2-yl)-acetic acid::CHEMBL74025
SMILES: OC(=O)Cc1ccc2c(CCc3ccccc3C2=O)c1
InChI Key: InChIKey=OYUDOANJBAWBBO-UHFFFAOYSA-N
Data: 1 IC50
Activity Spreadsheet -- Enzyme Inhibition Constant Data from BindingDB
Found 1 hit for monomerid = 50022261
Trg + Lig
Ki
nM
ΔG°
kcal/mole
IC50
nM
Kd
nM
EC50/IC50
nM
koff
s-1
kon
M-1s-1
pHTemp
°C
Aldose reductase (AR)
(Homo sapiens (Human))
BDBM50022261
((5-Oxo-10,11-dihydro-5H-dibenzo[a,d]cyclohepten-2-...)
Show SMILES OC(=O)Cc1ccc2c(CCc3ccccc3C2=O)c1
Show InChI InChI=1S/C17H14O3/c18-16(19)10-11-5-8-15-13(9-11)7-6-12-3-1-2-4-14(12)17(15)20/h1-5,8-9H,6-7,10H2,(H,18,19)
n/an/a 1.60E+5n/an/an/an/an/an/a
TBA
Curated by ChEMBL
Assay Description
In vitro inhibition of rabbit lens aldose reductase.
J Med Chem 29: 2347-51 (1986)
BindingDB Entry DOI: 10.7270/Q23R0RWW