BDBM50022264 (7-Hydroxy-5-oxo-10,11-dihydro-5H-dibenzo[a,d]cyclohepten-2-yl)-acetic acid::CHEMBL538917
SMILES: OC(=O)Cc1ccc2c(CCc3ccc(O)cc3C2=O)c1
InChI Key: InChIKey=DEODSEYJERVRIF-UHFFFAOYSA-N
Data: 1 IC50
Activity Spreadsheet -- Enzyme Inhibition Constant Data from BindingDB
Found 1 hit for monomerid = 50022264
Trg + Lig
Ki
nM
ΔG°
kcal/mole
IC50
nM
Kd
nM
EC50/IC50
nM
koff
s-1
kon
M-1s-1
pHTemp
°C
Aldose reductase (AR)
(Homo sapiens (Human))
BDBM50022264
((7-Hydroxy-5-oxo-10,11-dihydro-5H-dibenzo[a,d]cycl...)
Show SMILES OC(=O)Cc1ccc2c(CCc3ccc(O)cc3C2=O)c1
Show InChI InChI=1S/C17H14O4/c18-13-5-4-11-2-3-12-7-10(8-16(19)20)1-6-14(12)17(21)15(11)9-13/h1,4-7,9,18H,2-3,8H2,(H,19,20)
n/an/a 830n/an/an/an/an/an/a
TBA
Curated by ChEMBL
Assay Description
In vitro inhibition of rabbit lens aldose reductase.
J Med Chem 29: 2347-51 (1986)
BindingDB Entry DOI: 10.7270/Q23R0RWW