BDBM50022281 2-{4-[(2-Amino-4-hydroxy-pteridin-6-ylmethyl)-methyl-amino]-benzoylamino}-pentanedioic acid::CHEMBL276968
SMILES: CN(Cc1cnc2nc(N)[nH]c(=O)c2n1)c1ccc(cc1)C(=O)NC(CCC(O)=O)C(O)=O
InChI Key: InChIKey=HLIXOCXUWGDBNP-UHFFFAOYSA-N
Data: 2 IC50
Activity Spreadsheet -- Enzyme Inhibition Constant Data from BindingDB
Found 2 hits for monomerid = 50022281
Trg + Lig
Ki
nM
ΔG°
kcal/mole
IC50
nM
Kd
nM
EC50/IC50
nM
koff
s-1
kon
M-1s-1
pHTemp
°C
Thymidylate synthase
(Mus musculus)
BDBM50022281
(2-{4-[(2-Amino-4-hydroxy-pteridin-6-ylmethyl)-meth...)
Show SMILES CN(Cc1cnc2nc(N)[nH]c(=O)c2n1)c1ccc(cc1)C(=O)NC(CCC(O)=O)C(O)=O
Show InChI InChI=1S/C20H21N7O6/c1-27(9-11-8-22-16-15(23-11)18(31)26-20(21)25-16)12-4-2-10(3-5-12)17(30)24-13(19(32)33)6-7-14(28)29/h2-5,8,13H,6-7,9H2,1H3,(H,24,30)(H,28,29)(H,32,33)(H3,21,22,25,26,31)
Reactome pathway
n/an/a>1.00E+6n/an/an/an/an/an/a
TBA
Curated by ChEMBL
Assay Description
Inhibitory activity against thymidylate synthase in the intact L1210 cells
J Med Chem 29: 1263-9 (1987)
BindingDB Entry DOI: 10.7270/Q2BG2PK6
Thymidylate synthase
(Mus musculus)
BDBM50022281
(2-{4-[(2-Amino-4-hydroxy-pteridin-6-ylmethyl)-meth...)
Show SMILES CN(Cc1cnc2nc(N)[nH]c(=O)c2n1)c1ccc(cc1)C(=O)NC(CCC(O)=O)C(O)=O
Show InChI InChI=1S/C20H21N7O6/c1-27(9-11-8-22-16-15(23-11)18(31)26-20(21)25-16)12-4-2-10(3-5-12)17(30)24-13(19(32)33)6-7-14(28)29/h2-5,8,13H,6-7,9H2,1H3,(H,24,30)(H,28,29)(H,32,33)(H3,21,22,25,26,31)
Reactome pathway
n/an/a 6.60E+5n/an/an/an/an/an/a
TBA
Curated by ChEMBL
Assay Description
Inhibitory activity against thymidylate synthase in the intact L1210 cells
J Med Chem 29: 1263-9 (1987)
BindingDB Entry DOI: 10.7270/Q2BG2PK6