BDBM50022329 6-(2-Chloro-acetylamino)-2-{4-[(2,4-diamino-pteridin-6-ylmethyl)-methyl-amino]-benzoylamino}-hexanoic acid::CHEMBL287544
SMILES: CN(Cc1cnc2nc(N)nc(N)c2n1)c1ccc(cc1)C(=O)NC(CCCCNC(=O)CCl)C(O)=O
InChI Key: InChIKey=OUKAYMHBMLAPDR-UHFFFAOYSA-N
Data: 1 IC50
Activity Spreadsheet -- Enzyme Inhibition Constant Data from BindingDB
Found 1 hit for monomerid = 50022329
Trg + Lig
Ki
nM
ΔG°
kcal/mole
IC50
nM
Kd
nM
EC50/IC50
nM
koff
s-1
kon
M-1s-1
pHTemp
°C
Dihydrofolate reductase
(Mus musculus (Mouse))
BDBM50022329
(6-(2-Chloro-acetylamino)-2-{4-[(2,4-diamino-pterid...)
Show SMILES CN(Cc1cnc2nc(N)nc(N)c2n1)c1ccc(cc1)C(=O)NC(CCCCNC(=O)CCl)C(O)=O
Show InChI InChI=1S/C23H28ClN9O4/c1-33(12-14-11-28-20-18(29-14)19(25)31-23(26)32-20)15-7-5-13(6-8-15)21(35)30-16(22(36)37)4-2-3-9-27-17(34)10-24/h5-8,11,16H,2-4,9-10,12H2,1H3,(H,27,34)(H,30,35)(H,36,37)(H4,25,26,28,31,32)
Reactome pathway
n/an/a 32n/an/an/an/an/an/a
TBA
Curated by ChEMBL
Assay Description
Inhibition of dihydrofolate reductase(DHFR) from L1210/R81 cells
J Med Chem 30: 1463-9 (1987)
BindingDB Entry DOI: 10.7270/Q28C9WTT