BDBM50022545 CHEMBL3297894
SMILES: Cc1cc2c(Nc3ccc(F)c(Cl)c3)nc(C)nc2o1
InChI Key: InChIKey=CFCGQYSUNKOMQX-UHFFFAOYSA-N
Data: 2 IC50
Activity Spreadsheet -- Enzyme Inhibition Constant Data from BindingDB
Found 2 hits for monomerid = 50022545
Trg + Lig
Ki
nM
ΔG°
kcal/mole
IC50
nM
Kd
nM
EC50/IC50
nM
koff
s-1
kon
M-1s-1
pHTemp
°C
Vascular endothelial growth factor receptor 2
(Homo sapiens (Human))
BDBM50022545
(CHEMBL3297894)
Show SMILES Cc1cc2c(Nc3ccc(F)c(Cl)c3)nc(C)nc2o1
Show InChI InChI=1S/C14H11ClFN3O/c1-7-5-10-13(17-8(2)18-14(10)20-7)19-9-3-4-12(16)11(15)6-9/h3-6H,1-2H3,(H,17,18,19)
NCI pathway
Reactome pathway
n/an/a 58n/an/an/an/an/an/a
Duquesne University
Curated by ChEMBL
Assay Description
Inhibition of VEGFR2 in human U251 cells by phosphotyrosine ELISA assay
Bioorg Med Chem 22: 3753-72 (2014)
Article DOI: 10.1016/j.bmc.2014.04.049
BindingDB Entry DOI: 10.7270/Q20K2B45
Epidermal growth factor receptor
(Homo sapiens (Human))
BDBM50022545
(CHEMBL3297894)
Show SMILES Cc1cc2c(Nc3ccc(F)c(Cl)c3)nc(C)nc2o1
Show InChI InChI=1S/C14H11ClFN3O/c1-7-5-10-13(17-8(2)18-14(10)20-7)19-9-3-4-12(16)11(15)6-9/h3-6H,1-2H3,(H,17,18,19)
n/an/a 30n/an/an/an/an/an/a
Duquesne University
Curated by ChEMBL
Assay Description
Inhibition of EGFR in human A431 cells by phosphotyrosine ELISA assay
Bioorg Med Chem 22: 3753-72 (2014)
Article DOI: 10.1016/j.bmc.2014.04.049
BindingDB Entry DOI: 10.7270/Q20K2B45