BDBM50023329 13-Methyl-4,13-diaza-tricyclo[8.2.1.0*2,7*]trideca-2(7),3,5-triene::CHEMBL423579
SMILES: CN1C2CCC1c1cnccc1CC2
InChI Key: InChIKey=AKIHOESVDZLTDO-UHFFFAOYSA-N
Data: 2 IC50
Activity Spreadsheet -- Enzyme Inhibition Constant Data from BindingDB
Found 2 hits for monomerid = 50023329
Trg + Lig
Ki
nM
ΔG°
kcal/mole
IC50
nM
Kd
nM
EC50/IC50
nM
koff
s-1
kon
M-1s-1
pHTemp
°C
Acetylcholine receptor protein alpha/beta/delta/gamma chain
(Torpedo californica)
BDBM50023329
(13-Methyl-4,13-diaza-tricyclo[8.2.1.0*2,7*]trideca...)
Show SMILES CN1C2CCC1c1cnccc1CC2
Show InChI InChI=1S/C12H16N2/c1-14-10-3-2-9-6-7-13-8-11(9)12(14)5-4-10/h6-8,10,12H,2-5H2,1H3
Reactome pathway
n/an/a 2.00E+3n/an/an/an/an/an/a
Stauffer Chemical Company
Curated by ChEMBL
Assay Description
Inhibition of [3H]-MCC binding to rat brain membranes
J Med Chem 31: 506-9 (1988)
BindingDB Entry DOI: 10.7270/Q2B27T8K
Acetylcholine receptor protein alpha/beta/delta/gamma chain
(Torpedo californica)
BDBM50023329
(13-Methyl-4,13-diaza-tricyclo[8.2.1.0*2,7*]trideca...)
Show SMILES CN1C2CCC1c1cnccc1CC2
Show InChI InChI=1S/C12H16N2/c1-14-10-3-2-9-6-7-13-8-11(9)12(14)5-4-10/h6-8,10,12H,2-5H2,1H3
Reactome pathway
n/an/a 800n/an/an/an/an/an/a
Stauffer Chemical Company
Curated by ChEMBL
Assay Description
Inhibition of (-)-[3H]-nicotine binding to rat brain membranes
J Med Chem 31: 506-9 (1988)
BindingDB Entry DOI: 10.7270/Q2B27T8K