BDBM50023365 CHEMBL3329814
SMILES: OCC(O)CN1CCC(COC(=O)c2c3OCCCn3c3ccccc23)CC1
InChI Key: InChIKey=DRENIAATVFLPKC-UHFFFAOYSA-N
Data: 1 KI  1 IC50
Activity Spreadsheet -- Enzyme Inhibition Constant Data from BindingDB
Found 2 hits for monomerid = 50023365
Trg + Lig
Ki
nM
ΔG°
kcal/mole
IC50
nM
Kd
nM
EC50/IC50
nM
koff
s-1
kon
M-1s-1
pHTemp
°C
5-hydroxytryptamine receptor 4 (5-HT4)
(Homo sapiens (Human))
BDBM50023365
(CHEMBL3329814)
Show SMILES OCC(O)CN1CCC(COC(=O)c2c3OCCCn3c3ccccc23)CC1
Show InChI InChI=1S/C21H28N2O5/c24-13-16(25)12-22-9-6-15(7-10-22)14-28-21(26)19-17-4-1-2-5-18(17)23-8-3-11-27-20(19)23/h1-2,4-5,15-16,24-25H,3,6-14H2
0.0794n/an/an/an/an/an/an/an/a
University of Oslo
Curated by ChEMBL
Assay Description
Displacement of [3H]GR113808 from human 5HT4b receptor expressed in HEK293 cell membranes
Bioorg Med Chem Lett 24: 4598-602 (2014)
Article DOI: 10.1016/j.bmcl.2014.06.083
BindingDB Entry DOI: 10.7270/Q28W3FW7
Potassium voltage-gated channel subfamily H member 2
(Homo sapiens (Human))
BDBM50023365
(CHEMBL3329814)
Show SMILES OCC(O)CN1CCC(COC(=O)c2c3OCCCn3c3ccccc23)CC1
Show InChI InChI=1S/C21H28N2O5/c24-13-16(25)12-22-9-6-15(7-10-22)14-28-21(26)19-17-4-1-2-5-18(17)23-8-3-11-27-20(19)23/h1-2,4-5,15-16,24-25H,3,6-14H2
Reactome pathway
n/an/a 8.10E+4n/an/an/an/an/an/a
University of Oslo
Curated by ChEMBL
Assay Description
Inhibition of human ERG expressed in HEK293 cells assessed as reduction in channel tail current by patch clamp method
Bioorg Med Chem Lett 24: 4598-602 (2014)
Article DOI: 10.1016/j.bmcl.2014.06.083
BindingDB Entry DOI: 10.7270/Q28W3FW7