BDBM50023663 CHEMBL3341892
SMILES: Clc1ccc(NC(=O)Nc2cccc(c2)-c2cccc(n2)N2CCCC2)cc1Cl
InChI Key: InChIKey=NWCZTJUYWYAZKW-UHFFFAOYSA-N
Data: 2 IC50
Activity Spreadsheet -- Enzyme Inhibition Constant Data from BindingDB
Found 2 hits for monomerid = 50023663
Trg + Lig
Ki
nM
ΔG°
kcal/mole
IC50
nM
Kd
nM
EC50/IC50
nM
koff
s-1
kon
M-1s-1
pHTemp
°C
Cannabinoid receptor 2
(Homo sapiens (Human))
BDBM50023663
(CHEMBL3341892)
Show SMILES Clc1ccc(NC(=O)Nc2cccc(c2)-c2cccc(n2)N2CCCC2)cc1Cl
Show InChI InChI=1S/C22H20Cl2N4O/c23-18-10-9-17(14-19(18)24)26-22(29)25-16-6-3-5-15(13-16)20-7-4-8-21(27-20)28-11-1-2-12-28/h3-10,13-14H,1-2,11-12H2,(H2,25,26,29)
Reactome pathway
n/an/a>1.00E+4n/an/an/an/an/an/a
Research Triangle Institute
Curated by ChEMBL
Assay Description
Antagonist activity at human CB1 receptor stably expressed in RD-HGA16 cells assessed as inhibition of CP55,940-induced calcium mobilization after 15...
J Med Chem 57: 7758-69 (2014)
Article DOI: 10.1021/jm501042u
BindingDB Entry DOI: 10.7270/Q26W9CNX
Cannabinoid receptor 1
(Homo sapiens (Human))
BDBM50023663
(CHEMBL3341892)
Show SMILES Clc1ccc(NC(=O)Nc2cccc(c2)-c2cccc(n2)N2CCCC2)cc1Cl
Show InChI InChI=1S/C22H20Cl2N4O/c23-18-10-9-17(14-19(18)24)26-22(29)25-16-6-3-5-15(13-16)20-7-4-8-21(27-20)28-11-1-2-12-28/h3-10,13-14H,1-2,11-12H2,(H2,25,26,29)
NCI pathway
Reactome pathway
n/an/a 161n/an/an/an/an/an/a
Research Triangle Institute
Curated by ChEMBL
Assay Description
Antagonist activity at human CB1 receptor stably expressed in RD-HGA16 cells assessed as inhibition of CP55,940-induced calcium mobilization after 15...
J Med Chem 57: 7758-69 (2014)
Article DOI: 10.1021/jm501042u
BindingDB Entry DOI: 10.7270/Q26W9CNX