BDBM50023670 CHEMBL3341882
SMILES: Cc1ccc(NC(=O)Nc2cccc(c2)-c2cccc(n2)N2CCCC2)cc1
InChI Key: InChIKey=IWDABHJUMAOQJL-UHFFFAOYSA-N
Data: 1 IC50
Activity Spreadsheet -- Enzyme Inhibition Constant Data from BindingDB
Found 1 hit for monomerid = 50023670
Trg + Lig
Ki
nM
ΔG°
kcal/mole
IC50
nM
Kd
nM
EC50/IC50
nM
koff
s-1
kon
M-1s-1
pHTemp
°C
Cannabinoid receptor 1
(Homo sapiens (Human))
BDBM50023670
(CHEMBL3341882)
Show SMILES Cc1ccc(NC(=O)Nc2cccc(c2)-c2cccc(n2)N2CCCC2)cc1
Show InChI InChI=1S/C23H24N4O/c1-17-10-12-19(13-11-17)24-23(28)25-20-7-4-6-18(16-20)21-8-5-9-22(26-21)27-14-2-3-15-27/h4-13,16H,2-3,14-15H2,1H3,(H2,24,25,28)
NCI pathway
Reactome pathway
n/an/a 203n/an/an/an/an/an/a
Research Triangle Institute
Curated by ChEMBL
Assay Description
Antagonist activity at human CB1 receptor stably expressed in RD-HGA16 cells assessed as inhibition of CP55,940-induced calcium mobilization after 15...
J Med Chem 57: 7758-69 (2014)
Article DOI: 10.1021/jm501042u
BindingDB Entry DOI: 10.7270/Q26W9CNX