BDBM50023677 CHEMBL3341890
SMILES: CC(C)c1ccccc1NC(=O)Nc1cccc(c1)-c1cccc(n1)N1CCCC1
InChI Key: InChIKey=HRCYLFULZXRXQY-UHFFFAOYSA-N
Data: 1 IC50
Activity Spreadsheet -- Enzyme Inhibition Constant Data from BindingDB
Found 1 hit for monomerid = 50023677
Trg + Lig
Ki
nM
ΔG°
kcal/mole
IC50
nM
Kd
nM
EC50/IC50
nM
koff
s-1
kon
M-1s-1
pHTemp
°C
Cannabinoid receptor 1
(Homo sapiens (Human))
BDBM50023677
(CHEMBL3341890)
Show SMILES CC(C)c1ccccc1NC(=O)Nc1cccc(c1)-c1cccc(n1)N1CCCC1
Show InChI InChI=1S/C25H28N4O/c1-18(2)21-11-3-4-12-23(21)28-25(30)26-20-10-7-9-19(17-20)22-13-8-14-24(27-22)29-15-5-6-16-29/h3-4,7-14,17-18H,5-6,15-16H2,1-2H3,(H2,26,28,30)
NCI pathway
Reactome pathway
n/an/a>1.00E+4n/an/an/an/an/an/a
Research Triangle Institute
Curated by ChEMBL
Assay Description
Antagonist activity at human CB1 receptor stably expressed in RD-HGA16 cells assessed as inhibition of CP55,940-induced calcium mobilization after 15...
J Med Chem 57: 7758-69 (2014)
Article DOI: 10.1021/jm501042u
BindingDB Entry DOI: 10.7270/Q26W9CNX