BDBM50023686 CHEMBL3341896
SMILES: O=C(Nc1cccc(c1)-c1cccc(n1)N1CCCC1)Nc1ccc2ccccc2c1
InChI Key: InChIKey=QWLSDGPJFRNTFW-UHFFFAOYSA-N
Data: 1 IC50
Activity Spreadsheet -- Enzyme Inhibition Constant Data from BindingDB
Found 1 hit for monomerid = 50023686
Trg + Lig
Ki
nM
ΔG°
kcal/mole
IC50
nM
Kd
nM
EC50/IC50
nM
koff
s-1
kon
M-1s-1
pHTemp
°C
Cannabinoid receptor 1
(Homo sapiens (Human))
BDBM50023686
(CHEMBL3341896)
Show SMILES O=C(Nc1cccc(c1)-c1cccc(n1)N1CCCC1)Nc1ccc2ccccc2c1
Show InChI InChI=1S/C26H24N4O/c31-26(28-23-14-13-19-7-1-2-8-20(19)17-23)27-22-10-5-9-21(18-22)24-11-6-12-25(29-24)30-15-3-4-16-30/h1-2,5-14,17-18H,3-4,15-16H2,(H2,27,28,31)
NCI pathway
Reactome pathway
n/an/a 888n/an/an/an/an/an/a
Research Triangle Institute
Curated by ChEMBL
Assay Description
Antagonist activity at human CB1 receptor stably expressed in RD-HGA16 cells assessed as inhibition of CP55,940-induced calcium mobilization after 15...
J Med Chem 57: 7758-69 (2014)
Article DOI: 10.1021/jm501042u
BindingDB Entry DOI: 10.7270/Q26W9CNX