null
SMILES: Nc1nc(N)c2nc(CN(C=O)c3ccc(cc3)C(=O)NC(CCCNC(=O)c3ccc(Cl)cc3)C(O)=O)cnc2n1
InChI Key: InChIKey=XVKWCKAUCRQXJE-UHFFFAOYSA-N
Activity Spreadsheet -- Enzyme Inhibition Constant Data from BindingDB
Found 1 hit for monomerid = 50023721
Trg + Lig
Ki
nM
ΔG°
kcal/mole
IC50
nM
Kd
nM
EC50/IC50
nM
koff
s-1
kon
M-1s-1
pHTemp
°C
Dihydrofolate reductase
(Mus musculus (Mouse))
BDBM50023721
(5-(4-Chloro-benzoylamino)-2-{4-[(2,4-diamino-pteri...)
Show SMILES Nc1nc(N)c2nc(CN(C=O)c3ccc(cc3)C(=O)NC(CCCNC(=O)c3ccc(Cl)cc3)C(O)=O)cnc2n1
Show InChI InChI=1S/C27H26ClN9O5/c28-17-7-3-15(4-8-17)24(39)31-11-1-2-20(26(41)42)34-25(40)16-5-9-19(10-6-16)37(14-38)13-18-12-32-23-21(33-18)22(29)35-27(30)36-23/h3-10,12,14,20H,1-2,11,13H2,(H,31,39)(H,34,40)(H,41,42)(H4,29,30,32,35,36)
Reactome pathway
n/an/a 15n/an/an/an/an/an/a
Harvard Medical School
Curated by ChEMBL
Assay Description
Inhibition of dihydrofolate reductase (DHFR) from murine leukemia cells
J Med Chem 31: 1332-7 (1988)
BindingDB Entry DOI: 10.7270/Q2697454