BDBM50023880 9-(3-Methyl-but-2-enyl)-9H-purin-6-ylamine::CHEMBL298115
SMILES: [#6]\[#6](-[#6])=[#6]/[#6]-n1cnc2c(-[#7])ncnc12
InChI Key: InChIKey=QHLQYTNMSXEBIQ-UHFFFAOYSA-N
Data: 1 IC50
Activity Spreadsheet -- Enzyme Inhibition Constant Data from BindingDB
Found 1 hit for monomerid = 50023880
Trg + Lig
Ki
nM
ΔG°
kcal/mole
IC50
nM
Kd
nM
EC50/IC50
nM
koff
s-1
kon
M-1s-1
pHTemp
°C
Adenosylhomocysteinase
(Homo sapiens (Human))
BDBM50023880
(9-(3-Methyl-but-2-enyl)-9H-purin-6-ylamine | CHEMB...)
Show SMILES [#6]\[#6](-[#6])=[#6]/[#6]-n1cnc2c(-[#7])ncnc12
Show InChI InChI=1S/C10H13N5/c1-7(2)3-4-15-6-14-8-9(11)12-5-13-10(8)15/h3,5-6H,4H2,1-2H3,(H2,11,12,13)
Reactome pathway
n/an/a 930n/an/an/an/an/an/a
University of Kansas
Curated by ChEMBL
Assay Description
Evaluated for the 50% inhibition of bovine-liver S-Adenosyl-homocysteine (AdoHcy) hydrolase
J Med Chem 31: 1729-38 (1988)
BindingDB Entry DOI: 10.7270/Q2HM5920