BDBM50023888 5-(6-Amino-purin-9-yl)-pent-3-ene-1,2-diol::CHEMBL296107
SMILES: Nc1ncnc2n(C\C=C\C(O)CO)cnc12
InChI Key: InChIKey=SLKRDCRJTPFGNI-OWOJBTEDSA-N
Data: 1 IC50
Activity Spreadsheet -- Enzyme Inhibition Constant Data from BindingDB
Found 1 hit for monomerid = 50023888
Trg + Lig
Ki
nM
ΔG°
kcal/mole
IC50
nM
Kd
nM
EC50/IC50
nM
koff
s-1
kon
M-1s-1
pHTemp
°C
Adenosylhomocysteinase
(Homo sapiens (Human))
BDBM50023888
(5-(6-Amino-purin-9-yl)-pent-3-ene-1,2-diol | CHEMB...)
Show SMILES Nc1ncnc2n(C\C=C\C(O)CO)cnc12
Show InChI InChI=1S/C10H13N5O2/c11-9-8-10(13-5-12-9)15(6-14-8)3-1-2-7(17)4-16/h1-2,5-7,16-17H,3-4H2,(H2,11,12,13)/b2-1+
Reactome pathway
n/an/a 950n/an/an/an/an/an/a
University of Kansas
Curated by ChEMBL
Assay Description
Evaluated for the 50% inhibition of bovine-liver S-Adenosyl-homocysteine (AdoHcy) hydrolase
J Med Chem 31: 1729-38 (1988)
BindingDB Entry DOI: 10.7270/Q2HM5920